{"text_format":"1","workbook":"xlsx","n_sheets":5,"sheets":["Read Me","Assessment form","NGA_factors","Climate_pcode_xref","Climate_zones"],"not_rendered":{"charts":0,"images":10,"macros":1,"external_links":3,"defined_names":135,"comments":2,"pivot_tables":0},"unopened":[],"bounds":{"document_bytes":16777216,"sheet_cells":100000,"rows_first":2000,"rows_last":500,"rows_between":2000,"halvings":0,"cell_chars":16384,"cell_head_chars":4096},"cells_cut":0,"cells_raw":0,"read":"whole","date_system":"1900"}

{"sheet":"Read Me","index":0,"n_rows":27,"n_cols":9,"rows_kept":27,"cut":false,"hidden":false,"merged":[[25,4,25,5],[26,4,26,5],[19,4,19,5],[21,4,21,5],[22,4,22,5],[23,4,23,5],[24,4,24,5],[20,4,20,5],[10,2,10,7],[3,1,3,5],[4,1,4,2],[5,1,5,7],[6,1,6,7],[9,2,9,7],[11,2,11,7],[12,2,12,7],[13,2,13,7],[14,2,14,7],[16,2,16,7]]}
[]
[]
[null,null,null,null,null,"NSW Department of Planning, Industry and Environment\n4 Parramatta Square\nParramatta NSW 2150","T (02) 9995 5000\nE nabers@environment.nsw.gov.au \nnabers.gov.au "]
[null,"NABERS Cogeneration Calculator"]
[null,"Version:",null,"v3.0","Date:","2025-07-01"]
[null,"This tool is to be used to calculate the assessable energy from cogeneration and trigeneration systems."]
[null,"Rateable energy inputs are calculated based on the relative emissions, based on apportionted energy outputs of the system"]
[]
[null,"How to use this calculator"]
[null,1,"Enter data in grey cell cells"]
[null,2,"Intermediate calculations and unused inputs are in blue cells and should not be modified"]
[null,3,"Outputs are in yellow cells."]
[null,4,"Blue cells should not be edited, and will be empty or selected as <Select> for a dropdown cell. They will become grey when they need to be edited. ",null,null,null,null,null," "]
[null,5,"Pale blue cells in tables are locked and are calculation cells. They cannot be modified."]
[null,6,"There are Data validation messages across some tabs. For example \"Check ###\" messages will indicate if rows or columns haven't been completed properly. Please make sure you have addressed all error messages before submitting the spreadsheet."]
[]
[null,null,"If you have any issues using the spreadsheet, please contact the NABERS team"]
[]
[null,null,"Updates"]
[null,null,"Version","Date","Emissions Factors",null,"Notes"]
[null,null,"v3.0","2025-06-01","NGA 2024",null,"Update of emission factors."]
[null,null,"V2.0","2023-06-01","NGA 2022 - Feb 2023",null,"Update of emission factors."]
[null,null,"V1.3","2022-05-01","NGA 2021 - Aug 2021",null,"Review and update of calculator to align with update of Ruling document."]
[null,null,"V1.2","2021-12-01","NGA 2020 - Oct 2020",null,"Updated Emissions Factors, Interface, Verifications, Data Handling."]
[null,null,"V1.1","2020-06-01",null,null,"Updated Rating Calculator, including improved user inputs & interface, data verification, and L1 audit checks."]
[null,null,"V1.1 (draft)","2019-12-01",null,null,"Draft updated calculator."]
[null,null,"V1.0","2017-02-01",null,null,"First Release."]

{"sheet":"Assessment form","index":1,"n_rows":88,"n_cols":28,"rows_kept":88,"cut":false,"hidden":false,"merged":[[11,1,13,1],[42,1,46,1],[81,1,83,1],[21,1,25,1],[31,1,35,1],[17,1,18,1],[32,11,32,25],[16,11,16,25],[67,6,67,8],[68,6,68,8],[69,6,69,8]]}
[]
[null,null,null,null,"NABERS Energy"]
[null,null,null,null,"Cogeneration Calculator"]
[]
[null,null,null,null,"Version 2.0 (1 June 2023)"]
[]
[]
[]
[]
[null,"Step 1: Determining the system location",null,null,null,null,null,null,null,null,null,null,null,null,null,null,null,null,null,null,null,null,null,null,null,null,null,"Validations"]
[]
[null,"Step 1","Where is the co/trigeneration plant physically located?",null,null,null,"(i)",null,null,"ü"]
[null,null,"Enter the postcode for the Rated Premises",null,null,null,"(i)",null,null,"ü"]
[null,null,"Is the system a cogen or trigeneration system?",null,null,null,"(i)",null,null,"ü",null,null,null,null,null,null,null,null,null,null,null,null,null,null,null,null,null,{"$f":"IF($I$22<>\"<Select>\",1,0)","v":1}]
[]
[null,"Step 2: Measuring energy use and generation products"]
[null,null,null,null,null,null,null,null,null,null,null,"Step 2: Measuring energy use and generation products for apportionment"]
[null,"Step 2a","Generator fuel consumption by the co/trigen system [MJ]",null,null,null,"(i)",null,null,"ü"]
[null,null,"Auxiliary electricity used by the co/trigen system [kWh]",null,null,null,"(i)",null,null,"ü"]
[]
[null,"Step 2b"]
[null,"Step 2b","Have all electricity outputs been metered?",null,null,null,"(i)",null,null,"ü",null,null,null,null,null,null,null,null,null,null,null,null,null,null,null,null,null,{"$f":"IF($I$22<>\"<Select>\",1,0)","v":1}]
[null,null,"Electricity generation [kWh]",null,null,null,"(i)",null,null,"ü",null,null,null,null,null,null,null,null,null,null,null,null,null,null,null,null,null,{"$f":"IF($I$22=\"No\",1,IF(AND(ISNUMBER(I23),I23>0),1,0))","v":0}]
[null,null,"Have all useful thermal energy outcomes been metered?",null,null,null,"(i)",null,null,"ü",null,null,null,null,null,null,null,null,null,null,null,null,null,null,null,null,null,{"$f":"IF($I$22<>\"Yes\",1,IF(I24<>\"<Select>\",1,0))","v":1}]
[null,null,"Metered Heating hot water [kWhth]",null,null,null,"(i)",null,null,"ü",null,null,{"$f":"IF(I29=0,\"\",IF(OR(I29=\"NA\",I29=\"\"),1,IF(I29>0,I38/I29,0)))","v":""},null,{"$f":"IF(M25=\"\",\"\",1-M25)","v":""},null,null,null,{"$f":"IF(I37=0,\"\",IF(OR(I28=\"NA\",I28=\"\"),1,IF(I28>0,I37/I28,0)))","v":""},null,{"$f":"IF(S25=\"\",\"\",1-S25)","v":""},null,null,{"$f":"IF(I30=0,\"\",IF(OR(I39=\"NA\",I39=\"\"),1,IF(I39>0,I39/I30,0)))","v":""},null,{"$f":"IF(X25=\"\",\"\",1-X25)","v":""},null,{"$f":"IF(OR($I$22=\"No\",I23=\"No\"),1,IF(AND(ISNUMBER(I25),I25>=0),1,0))","v":0}]
[null,null,"Metered Chilled water generation [kWhth]",null,null,null,"(i)",null,null,"ü",null,null,null,null,null,null,null,null,null,null,null,null,null,null,null,null,null,{"$f":"IF(OR($I$22=\"No\",I23=\"No\"),1,IF(AND(ISNUMBER(I26),I26>=0),1,0))","v":0}]
[null,null,"Default thermal water generation (when thermal outputs unmetered) [kWhth]",null,null,null,null,null,{"$f":"MAX(0.75*I18/3.6-IF(I22<>\"Yes\",0,I23),0)","v":0}]
[null,null,"Used value for generated Electricity [kWh]",null,null,null,null,null,{"$f":"IF(I22<>\"Yes\",0,I23)","v":0}]
[null,null,"Used value for generated Heating Hot Water [kWhth]",null,null,null,null,null,{"$f":"IF(I22<>\"Yes\",IF(I14=\"Cogen\",I27,0),IF(I24<>\"Yes\",IF(I14=\"Cogen\",I27,0),I25))","v":0},null,null,null,null,{"$f":"IF(I29=0,\"NA\",CONCATENATE(FIXED(I29,0),\" kWh\"))","v":"NA"},null,null,null,null,null,{"$f":"IF(I28=0,\"NA\",CONCATENATE(FIXED(I28,0),\" kWh\"))","v":"NA"},null,null,null,null,{"$f":"IF(I30=0,\"NA\",CONCATENATE(FIXED(I30,0),\" kWh\"))","v":"NA"}]
[null,null,"Used value for generated Chilled Water [kWhth]",null,null,null,null,null,{"$f":"IF(I22<>\"Yes\",IF(I14=\"Trigen\",I27,0),IF(I24<>\"Yes\",IF(I14=\"Trigen\",I27,0),I26))","v":0}]
[]
[null,"Step 2c","Was electricity to the Rated Premises submetered?",null,null,null,"(i)",null,null,"ü",null,null,null,null,null,null,null,null,null,null,null,null,null,null,null,null,null,{"$f":"IF($I$22<>\"Yes\",1,IF(I32<>\"<Select>\",1,0))","v":1}]
[null,null,"Electricity from co/trigen plant to Rated Premises [kWhe]",null,null,null,"(i)",null,null,"ü",null,"Step 3: Allocating energy to the Rated premises",null,null,null,null,null,null,null,null,null,null,null,null,null,null,null,{"$f":"IF(OR($I$22<>\"Yes\",I32=\"No\"),1,IF(AND(ISNUMBER(I33),I33>0),1,0))","v":1}]
[null,null,"Was thermal energy to the Rated Premises themally metered?",null,null,null,"(i)",null,null,"ü",null,null,null,null,null,null,null,null,null,null,null,null,null,null,null,null,null,{"$f":"IF(OR($I$22<>\"Yes\",I24=\"No\"),1,IF(I34<>\"<Select>\",1,0))","v":1}]
[null,null,"Metered Heating hot water from co/trigen plant to Rated Premises [kWhth]",null,null,null,"(i)",null,null,"ü",null,null,null,null,null,null,null,null,null,null,null,null,null,null,null,null,null,{"$f":"IF(OR($I$22<>\"Yes\",I23=\"No\",I34=\"No\"),1,IF(AND(ISNUMBER(I35),I35>=0),1,0))","v":1}]
[null,null,"Metered Chilled water from co/trigen plant to Rated Premises [kWhth]",null,null,null,"(i)",null,null,"ü",null,null,null,null,null,null,null,null,{"$f":"CONCATENATE(\"Fuel input: \",FIXED($I$43,0),\" MJ\")","v":{"$error":"#VALUE!"}},null,null,null,null,null,null,null,null,{"$f":"IF(OR($I$22<>\"Yes\",I23=\"No\",I34=\"No\"),1,IF(AND(ISNUMBER(I36),I36>=0),1,0))","v":1}]
[null,null,"Used value for metered electricity to Rated Premises [kWh]",null,null,null,null,null,{"$f":"IF(I32<>\"Yes\",I28,IF(I33=0,I28,I33))","v":0}]
[null,null,"Used value for metered Heating hot water from co/trigen plant to Rated Premises [kWhth]",null,null,null,null,null,{"$f":"IF(I34<>\"Yes\",I29,IF(I35=0,I29,I35))","v":0}]
[null,null,"Used value for metered Chilled water from co/trigen plant to Rated Premises [kWhth]",null,null,null,null,null,{"$f":"IF(I34<>\"Yes\",I30,IF(I36=0,I30,I36))","v":0}]
[null,null,null,null,null,null,null,null,null,null,null,null,null,null,null,null,null,null,{"$f":"CONCATENATE(\"Auxiliaries: \",FIXED($I$44,0),\" kWh\")","v":{"$error":"#VALUE!"}},null,null,null,"Rated Premises"]
[null,"Step 3: Allocating energy and emissions to users",null,null,null,null,null,null,null,null,null,null,null,null,null,null,null,null,{"$f":"IF(I12=\"Offsite\",CONCATENATE(\"Offsite cogen electricity: \",FIXED($I$46,0),\" kWh\"),\"\")","v":""}]
[null,null,null,null,null,null,null,null,null,null,null,null,null,null,null,null,null,null,{"$f":"IF(I12=\"Offsite\",CONCATENATE(\"Offsite cogen electricity GreenPower: \",FIXED($I$47*100,0),\" %\"),\"\")","v":""}]
[null,"Step 3","Generator fuel allocated to Rated Premises (MJ)",null,null,null,"(i)",null,{"$f":"IF(ISNUMBER(F78),IF(I12=\"Onsite\",$F$78*I18,$F$76*I18),\"\")","v":""},"ü",null,null,null,null,null,null,null,null,null,null,null,null,null,null,null,null,null,{"$f":"IF(AND(ISNUMBER(I43),I43>=0),1,0)","v":0}]
[null,null,"Auxiliary electricity allocated to Rated Premises (kWh)",null,null,null,"(i)",null,{"$f":"IF(ISNUMBER(F78),IF(I12=\"Onsite\",$F$78*I19,$F$78*I19),\"\")","v":""},"ü",null,null,null,null,null,null,null,null,null,null,null,null,null,null,null,null,null,{"$f":"IF(AND(ISNUMBER(I44),I44>=0),1,0)","v":0}]
[]
[null,null,"Offsite cogeneration electricity allocated to rated premises (kWh)",null,null,null,"(i)",null,{"$f":"IF(ISNUMBER(F78),IF(I12=\"Onsite\",0,F72*I23),\"\")","v":""},"ü",null,null,null,null,null,null,null,null,null,null,null,null,null,null,null,null,null,{"$f":"IF(AND(ISNUMBER(I46),I46>=0),1,0)","v":0}]
[null,null,"GreenPower % for offsite cogen elec",null,null,null,"(i)",null,{"$f":"IF(ISNUMBER(F78),IF(I12=\"Onsite\",0,I88),\"\")","v":""},"ü",null,null,null,null,null,null,null,null,null,null,null,null,null,null,null,null,null,{"$f":"IF(AND(ISNUMBER(I44),I44>=0),1,0)","v":0}]
[]
[]
[]
[]
[]
[]
[null,"rows 46 to 70 hidden"]
[null,"Calculations"]
[]
[null,"Parameters"]
[null,"State",null,null,null,{"$f":"VLOOKUP('Assessment form'!I13,Climate_pcode_xref!A2:C3727,3,FALSE)","v":{"$error":"#N/A"}}]
[null,"SGEelec, kgCO2/kWh",null,null,null,{"$f":"VLOOKUP('Assessment form'!F58,NGA_factors!E2:N9,10,FALSE)","v":{"$error":"#N/A"}},"kgCO2/kWh"]
[null,"SGEheat = SGEgas, kgCO2/MJ",null,null,null,{"$f":"VLOOKUP('Assessment form'!F58,NGA_factors!E10:N17,10,FALSE)","v":{"$error":"#N/A"}},"kgCO2/MJ"]
[]
[null,"Apportioning to power and thermal energy outputs"]
[null,"Emissions to electricity generation",null,null,null,{"$f":"I28*F59","v":{"$error":"#N/A"}},"kgCO2"]
[null,"Emissions to heating hot water",null,null,null,{"$f":"(I29*3.6)/0.75*F60","v":{"$error":"#N/A"}},"kgCO2"]
[null,"Emissions to chilled water",null,null,null,{"$f":"I30/(4)*F59","v":{"$error":"#N/A"}},"kgCO2"]
[null,"Total emissions",null,null,null,{"$f":"SUM(F63:F65)","v":{"$error":"#N/A"}},"kgCO2"]
[]
[null,"Percentage emissions to electricity",null,null,null,{"$f":"F63/$F$66","v":{"$error":"#N/A"}}]
[null,"Percentage emissions to heating hot water",null,null,null,{"$f":"F64/$F$66","v":{"$error":"#N/A"}}]
[null,"Percentage emissions to chilled water",null,null,null,{"$f":"F65/$F$66","v":{"$error":"#N/A"}}]
[]
[null,"Electricity to rated premises",null,null,null,{"$f":"IF(OR(I28=\"NA\",I28=\"\"),1,IF(I28>0,I37/I28,0))","v":0}]
[null,"Heating hot water to rated premises",null,null,null,{"$f":"IF(OR(I29=\"NA\",I29=\"\"),1,IF(I29>0,I38/I29,0))","v":0}]
[null,"Chilled water to rated premises",null,null,null,{"$f":"IF(OR(I30=\"NA\",I30=\"\"),1,IF(I30>0,I39/I30,0))","v":0}]
[]
[null,"Inputs allocated to Rated Premises (thermal)",null,null,null,{"$f":"F69*F73+F70*F74","v":{"$error":"#N/A"}}]
[null,"Inputs allocated to Rated Premises (power)",null,null,null,{"$f":"F68*F72","v":{"$error":"#N/A"}}]
[null,null,null,null,null,{"$f":"SUM(F76:F77)","v":{"$error":"#N/A"}}]
[]
[]
[]
[null,"Step 3a","Energy inputs allocated to electricity generation (%)",null,null,null,"(i)",null,{"$f":"IF($I$22=\"Yes\",F68,\"\")","v":""},"ü",null,"Step 3a: Allocating inputs to thermal and electricity outputs",null,null,null,null,null,null,null,null,null,null,null,null,null,null,null,{"$f":"IF(AND(ISNUMBER(I82),I82>=0),1,0)","v":0}]
[null,null,"Energy inputs allocated to heating hot water generation (%)",null,null,null,"(i)",null,{"$f":"IF($I$22=\"Yes\",F69,\"\")","v":""},"ü",null,null,null,null,null,null,null,null,null,null,null,null,null,null,null,null,null,{"$f":"IF(AND(ISNUMBER(I83),I83>=0),1,0)","v":0}]
[null,null,"Energy inputs allocated to chilled water generation (%)",null,null,null,"(i)",null,{"$f":"IF($I$22=\"Yes\",F70,\"\")","v":""},"ü",null,null,null,null,null,null,null,null,null,null,null,{"$f":"IF(I22=\"No\",\" Not required\",IF(SUM(AB22:AB26)<5,\" Step 2b is incomplete\",CONCATENATE(\" \",FIXED(I83*100,1),\"% to heating hot water users\")))","v":" Step 2b is incomplete"},null,null,null,null,null,{"$f":"IF(AND(ISNUMBER(I84),I84>=0),1,0)","v":0}]
[null,null,null,null,null,null,null,null,null,null,null,null,null,null,null,{"$f":"CONCATENATE(\"Fuel: \",FIXED($I$18,0),\" MJ\")","v":"Fuel: 0 MJ"}]
[null,"Offsite Cogen Associated fuel input (MJ)",null,null,null,null,null,null,{"$f":"IF(ISNUMBER(F78),IF(I12=\"Onsite\",0,F77*I18),\"\")","v":""},null,null,null,null,null,null,{"$f":"CONCATENATE(\"Auxiliaries: \",FIXED($I$19,0),\" kWh\")","v":"Auxiliaries: 0 kWh"},null,null,null,null,null,null,{"$f":"IF(I22=\"No\",\"Not required\",IF(SUM(AB22:AB26)<5,\"Step 2b is incomplete\",CONCATENATE(FIXED(I82*100,1),\"% to electricity users\")))","v":"Step 2b is incomplete"}]
[null,"Equivalent Elec (kWh) for offsite cogen elec corresponding gas use",null,null,null,null,null,null,{"$f":"I86*F60/F59","v":{"$error":"#VALUE!"}}]
[null,"GreenPower % for offsite cogen elec",null,null,null,null,null,null,{"$f":"(I46-I87)/I46","v":{"$error":"#VALUE!"}},null,null,null,null,null,null,null,null,null,null,null,null,{"$f":"IF(I22=\"No\",\" Not required\",IF(SUM(AB22:AB26)<5,\" Step 2b is incomplete\",CONCATENATE(\" \",FIXED(I84*100,1),\"% to chilled water users\")))","v":" Step 2b is incomplete"}]

{"sheet":"NGA_factors","index":2,"n_rows":41,"n_cols":19,"rows_kept":41,"cut":false,"hidden":true,"merged":[]}
["id","fuelId","fuel","stateId","state","S1_EF_CO2","S1_EF_CH4","S1_EF_N2O","S2_EF","S3_EF","Emission Factor","Energy content factor","Energy content factor unit","SGE123","SGE12","SGE Unit","Release date",null,"Data from Column F, I & J from https://www.dcceew.gov.au/sites/default/files/documents/national-greenhouse-accounts-factors-2022.pdf"]
[1,1,"Electricity",7,"ACT",0,0,0,0.66,0.04,"kgCO2-e/kWh","n/a",null,{"$f":"SUM(F2:J2)","v":0.70000000000000007},{"$f":"SUM(F2:I2)","v":0.66},"kgCO2-e/kWh",2024]
[2,1,"Electricity",6,"NSW",0,0,0,0.66,0.04,"kgCO2-e/kWh","n/a",null,{"$f":"SUM(F3:J3)","v":0.70000000000000007},{"$f":"SUM(F3:I3)","v":0.66},"kgCO2-e/kWh",2024]
[3,1,"Electricity",8,"NT",0,0,0,0.56000000000000005,7.0000000000000007E-2,"kgCO2-e/kWh","n/a",null,{"$f":"SUM(F4:J4)","v":0.63000000000000012},0.56000000000000005,"kgCO2-e/kWh",2024]
[4,1,"Electricity",5,"QLD",0,0,0,0.71,0.1,"kgCO2-e/kWh","n/a",null,0.80999999999999994,0.71,"kgCO2-e/kWh",2024]
[5,1,"Electricity",4,"SA",0,0,0,0.23,0.05,"kgCO2-e/kWh","n/a",null,0.28000000000000003,0.23,"kgCO2-e/kWh",2024]
[6,1,"Electricity",3,"TAS",0,0,0,0.15,0.03,"kgCO2-e/kWh","n/a",null,0.18,0.15,"kgCO2-e/kWh",2024]
[7,1,"Electricity",2,"VIC",0,0,0,0.77,0.09,"kgCO2-e/kWh","n/a",null,0.86,0.77,"kgCO2-e/kWh",2024]
[8,1,"Electricity",1,"WA",0,0,0,0.61,0.09,"kgCO2-e/kWh","n/a",null,0.7,0.61,"kgCO2-e/kWh",2024]
[9,2,"Gas",7,"ACT",51.53,0.1,0.03,0,13.1,"kgCO2-e/GJ","n/a",null,{"$f":"SUM(F10:J10)/1000","v":6.4760000000000012E-2},{"$f":"SUM(F10:I10)/1000","v":5.1660000000000005E-2},"kgCO2-e/MJ",2024]
[10,2,"Gas",6,"NSW",51.53,0.1,0.03,0,13.1,"kgCO2-e/GJ","n/a",null,{"$f":"SUM(F11:J11)/1000","v":6.4760000000000012E-2},5.1660000000000005E-2,"kgCO2-e/MJ",2024]
[11,2,"Gas",8,"NT",51.53,0.1,0.03,0,4.0999999999999996,"kgCO2-e/GJ","n/a",null,{"$f":"SUM(F12:J12)/1000","v":5.5760000000000004E-2},5.1660000000000005E-2,"kgCO2-e/MJ",2024]
[12,2,"Gas",5,"QLD",51.53,0.1,0.03,0,8.8000000000000007,"kgCO2-e/GJ","n/a",null,{"$f":"SUM(F13:J13)/1000","v":6.0460000000000007E-2},5.1660000000000005E-2,"kgCO2-e/MJ",2024]
[13,2,"Gas",4,"SA",51.53,0.1,0.03,0,10.7,"kgCO2-e/GJ","n/a",null,{"$f":"SUM(F14:J14)/1000","v":6.2359999999999999E-2},5.1660000000000005E-2,"kgCO2-e/MJ",2024]
[14,2,"Gas",3,"TAS",51.53,0.1,0.03,0,4,"kgCO2-e/GJ","n/a",null,5.7299999999999997E-2,5.1660000000000005E-2,"kgCO2-e/MJ",2024]
[15,2,"Gas",2,"VIC",51.53,0.1,0.03,0,4,"kgCO2-e/GJ","n/a",null,5.7299999999999997E-2,5.1660000000000005E-2,"kgCO2-e/MJ",2024]
[16,2,"Gas",1,"WA",51.53,0.1,0.03,0,4.0999999999999996,"kgCO2-e/GJ","n/a",null,{"$f":"SUM(F17:J17)/1000","v":5.5760000000000004E-2},5.1660000000000005E-2,"kgCO2-e/MJ",2024]
[17,3,"Coal",7,"ACT",90.24,4.4999999999999998E-2,0.25,0,3,"kgCO2-e/GJ",{"$f":"(22.1+27)/2","v":24.55},"GJ/t",2.43648,{"$f":"SUM(F18:I18)*L18/1000","v":2.22263425},"kgCO2-e/kg",2024]
[18,3,"Coal",6,"NSW",90.24,4.4999999999999998E-2,0.25,0,3,"kgCO2-e/GJ",24.55,"GJ/t",2.43648,{"$f":"SUM(F19:I19)*L19/1000","v":2.22263425},"kgCO2-e/kg",2024]
[19,3,"Coal",8,"NT",90.24,4.4999999999999998E-2,0.25,0,3,"kgCO2-e/GJ",24.55,"GJ/t",2.43648,2.22263425,"kgCO2-e/kg",2024]
[20,3,"Coal",5,"QLD",90.24,4.4999999999999998E-2,0.25,0,3,"kgCO2-e/GJ",24.55,"GJ/t",2.43648,2.22263425,"kgCO2-e/kg",2024]
[21,3,"Coal",4,"SA",90.24,4.4999999999999998E-2,0.25,0,3,"kgCO2-e/GJ",24.55,"GJ/t",2.43648,2.22263425,"kgCO2-e/kg",2024]
[22,3,"Coal",3,"TAS",90.24,4.4999999999999998E-2,0.25,0,3,"kgCO2-e/GJ",24.55,"GJ/t",2.43648,2.22263425,"kgCO2-e/kg",2024]
[23,3,"Coal",2,"VIC",90.24,4.4999999999999998E-2,0.25,0,3,"kgCO2-e/GJ",24.55,"GJ/t",2.43648,2.22263425,"kgCO2-e/kg",2024]
[24,3,"Coal",1,"WA",90.24,4.4999999999999998E-2,0.25,0,3,"kgCO2-e/GJ",24.55,"GJ/t",2.43648,2.22263425,"kgCO2-e/kg",2024]
[25,4,"Oil",7,"ACT",70.2,0.1,0.2,0,17.3,"kgCO2-e/GJ",38.6,"GJ/kL",3.3774999999999999,2.7097200000000004,"kgCO2-e/L",2024]
[26,4,"Oil",6,"NSW",70.2,0.1,0.2,0,17.3,"kgCO2-e/GJ",38.6,"GJ/kL",3.3774999999999999,2.7097200000000004,"kgCO2-e/L",2024]
[27,4,"Oil",8,"NT",70.2,0.1,0.2,0,17.3,"kgCO2-e/GJ",38.6,"GJ/kL",3.3774999999999999,2.7097200000000004,"kgCO2-e/L",2024]
[28,4,"Oil",5,"QLD",70.2,0.1,0.2,0,17.3,"kgCO2-e/GJ",38.6,"GJ/kL",3.3774999999999999,2.7097200000000004,"kgCO2-e/L",2024]
[29,4,"Oil",4,"SA",70.2,0.1,0.2,0,17.3,"kgCO2-e/GJ",38.6,"GJ/kL",3.3774999999999999,2.7097200000000004,"kgCO2-e/L",2024]
[30,4,"Oil",3,"TAS",70.2,0.1,0.2,0,17.3,"kgCO2-e/GJ",38.6,"GJ/kL",3.3774999999999999,2.7097200000000004,"kgCO2-e/L",2024]
[31,4,"Oil",2,"VIC",70.2,0.1,0.2,0,17.3,"kgCO2-e/GJ",38.6,"GJ/kL",3.3774999999999999,2.7097200000000004,"kgCO2-e/L",2024]
[32,4,"Oil",1,"WA",70.2,0.1,0.2,0,17.3,"kgCO2-e/GJ",38.6,"GJ/kL",3.3774999999999999,2.7097200000000004,"kgCO2-e/L",2024]
[33,5,"LPG",7,"ACT",60.6,0,0,0,20.2,"kgCO2-e/GJ",0,"GJ/kL",2.0765599999999997,1.55742,"kgCO2-e/L",2024]
[34,5,"LPG",6,"NSW",60.6,0,0,0,20.2,"kgCO2-e/GJ",0,"GJ/kL",2.0765599999999997,1.55742,"kgCO2-e/L",2024]
[35,5,"LPG",8,"NT",60.6,0,0,0,20.2,"kgCO2-e/GJ",0,"GJ/kL",2.0765599999999997,1.55742,"kgCO2-e/L",2024]
[36,5,"LPG",5,"QLD",60.6,0,0,0,20.2,"kgCO2-e/GJ",0,"GJ/kL",2.0765599999999997,1.55742,"kgCO2-e/L",2024]
[37,5,"LPG",4,"SA",60.6,0,0,0,20.2,"kgCO2-e/GJ",0,"GJ/kL",2.0765599999999997,1.55742,"kgCO2-e/L",2024]
[38,5,"LPG",3,"TAS",60.6,0,0,0,20.2,"kgCO2-e/GJ",0,"GJ/kL",2.0765599999999997,1.55742,"kgCO2-e/L",2024]
[39,5,"LPG",2,"VIC",60.6,0,0,0,20.2,"kgCO2-e/GJ",0,"GJ/kL",2.0765599999999997,1.55742,"kgCO2-e/L",2024]
[40,5,"LPG",1,"WA",60.6,0,0,0,20.2,"kgCO2-e/GJ",0,"GJ/kL",2.0765599999999997,1.55742,"kgCO2-e/L",2024]

{"sheet":"Climate_pcode_xref","index":3,"n_rows":3727,"n_cols":3,"rows_kept":3727,"cut":false,"hidden":true,"merged":[]}
["Postcode","Climate_zone","State"]
[200,64,{"$f":"IF(OR(A2<=299,AND(A2<3000,A2>=1000)),\"NSW\",IF(AND(A2<=999,A2>=800),\"NT\",IF(OR(AND(A2<=8999,A2>=8000),AND(A2<=3999,A2>=3000)),\"VIC\",IF(OR(AND(A2<=9999,A2>=9000),AND(A2<=4999,A2>=4000)),\"QLD\",IF(AND(A2<=5999,A2>=5000),\"SA\",IF(AND(A2<=6999,A2>=6000),\"WA\",\"TAS\"))))))","v":"NSW"}]
[211,64,"NSW"]
[212,64,"NSW"]
[230,64,"NSW"]
[237,64,"NSW"]
[238,64,"NSW"]
[239,64,"NSW"]
[240,64,"NSW"]
[241,64,"NSW"]
[242,64,"NSW"]
[243,64,"NSW"]
[244,64,"NSW"]
[245,64,"NSW"]
[246,64,"NSW"]
[247,64,"NSW"]
[248,64,"NSW"]
[249,64,"NSW"]
[250,64,"NSW"]
[251,64,"NSW"]
[252,64,"NSW"]
[253,64,"NSW"]
[254,64,"NSW"]
[255,64,"NSW"]
[256,64,"NSW"]
[257,64,"NSW"]
[258,64,"NSW"]
[259,64,"NSW"]
[260,64,"NSW"]
[261,64,"NSW"]
[262,64,"NSW"]
[263,64,"NSW"]
[264,64,"NSW"]
[266,64,"NSW"]
[267,64,"NSW"]
[268,64,"NSW"]
[269,64,"NSW"]
[270,64,"NSW"]
[271,64,"NSW"]
[272,64,"NSW"]
[273,64,"NSW"]
[274,64,"NSW"]
[275,64,"NSW"]
[276,64,"NSW"]
[277,64,"NSW"]
[278,64,"NSW"]
[279,64,"NSW"]
[280,64,"NSW"]
[281,64,"NSW"]
[282,64,"NSW"]
[283,64,"NSW"]
[284,64,"NSW"]
[285,64,"NSW"]
[286,64,"NSW"]
[287,64,"NSW"]
[288,64,"NSW"]
[289,64,"NSW"]
[290,64,"NSW"]
[291,64,"NSW"]
[293,64,"NSW"]
[294,64,"NSW"]
[295,64,"NSW"]
[296,64,"NSW"]
[297,64,"NSW"]
[298,64,"NSW"]
[299,64,{"$f":"IF(OR(A66<=299,AND(A66<3000,A66>=1000)),\"NSW\",IF(AND(A66<=999,A66>=800),\"NT\",IF(OR(AND(A66<=8999,A66>=8000),AND(A66<=3999,A66>=3000)),\"VIC\",IF(OR(AND(A66<=9999,A66>=9000),AND(A66<=4999,A66>=4000)),\"QLD\",IF(AND(A66<=5999,A66>=5000),\"SA\",IF(AND(A66<=6999,A66>=6000),\"WA\",\"TAS\"))))))","v":"NSW"}]
[800,66,"NT"]
[801,66,"NT"]
[804,66,"NT"]
[810,66,"NT"]
[811,66,"NT"]
[812,66,"NT"]
[813,66,"NT"]
[814,66,"NT"]
[815,66,"NT"]
[820,66,"NT"]
[821,66,"NT"]
[822,66,"NT"]
[828,66,"NT"]
[830,66,"NT"]
[831,66,"NT"]
[832,66,"NT"]
[835,66,"NT"]
[836,66,"NT"]
[837,66,"NT"]
[840,66,"NT"]
[845,66,"NT"]
[846,66,"NT"]
[847,66,"NT"]
[850,66,"NT"]
[851,66,"NT"]
[852,66,"NT"]
[853,66,"NT"]
[854,66,"NT"]
[860,70,"NT"]
[861,70,"NT"]
[862,70,"NT"]
[870,71,"NT"]
[871,71,"NT"]
[872,71,"NT"]
[880,67,"NT"]
[881,67,"NT"]
[885,67,"NT"]
[886,66,"NT"]
[909,66,"NT"]
[1001,63,"NSW"]
[1002,63,"NSW"]
[1003,63,"NSW"]
[1004,63,"NSW"]
[1005,63,"NSW"]
[1006,63,"NSW"]
[1007,63,"NSW"]
[1008,63,"NSW"]
[1009,63,"NSW"]
[1010,63,"NSW"]
[1011,63,"NSW"]
[1012,63,"NSW"]
[1013,63,"NSW"]
[1015,63,"NSW"]
[1016,63,"NSW"]
[1017,63,"NSW"]
[1018,63,"NSW"]
[1019,63,"NSW"]
[1020,63,"NSW"]
[1021,63,"NSW"]
[1022,63,"NSW"]
[1023,63,"NSW"]
[1024,63,"NSW"]
[1025,63,"NSW"]
[1026,63,{"$f":"IF(OR(A130<=299,AND(A130<3000,A130>=1000)),\"NSW\",IF(AND(A130<=999,A130>=800),\"NT\",IF(OR(AND(A130<=8999,A130>=8000),AND(A130<=3999,A130>=3000)),\"VIC\",IF(OR(AND(A130<=9999,A130>=9000),AND(A130<=4999,A130>=4000)),\"QLD\",IF(AND(A130<=5999,A130>=5000),\"SA\",IF(AND(A130<=6999,A130>=6000),\"WA\",\"TAS\"))))))","v":"NSW"}]
[1027,63,"NSW"]
[1028,63,"NSW"]
[1029,63,"NSW"]
[1030,63,"NSW"]
[1031,63,"NSW"]
[1032,63,"NSW"]
[1033,63,"NSW"]
[1034,63,"NSW"]
[1035,63,"NSW"]
[1036,63,"NSW"]
[1037,63,"NSW"]
[1038,63,"NSW"]
[1039,63,"NSW"]
[1040,63,"NSW"]
[1041,63,"NSW"]
[1042,63,"NSW"]
[1043,63,"NSW"]
[1044,63,"NSW"]
[1045,63,"NSW"]
[1046,63,"NSW"]
[1047,63,"NSW"]
[1048,63,"NSW"]
[1049,63,"NSW"]
[1050,63,"NSW"]
[1051,63,"NSW"]
[1052,63,"NSW"]
[1053,63,"NSW"]
[1054,63,"NSW"]
[1055,63,"NSW"]
[1056,63,"NSW"]
[1057,63,"NSW"]
[1058,63,"NSW"]
[1059,63,"NSW"]
[1060,63,"NSW"]
[1061,63,"NSW"]
[1062,63,"NSW"]
[1063,63,"NSW"]
[1064,63,"NSW"]
[1065,63,"NSW"]
[1066,63,"NSW"]
[1067,63,"NSW"]
[1068,63,"NSW"]
[1069,63,"NSW"]
[1070,63,"NSW"]
[1071,63,"NSW"]
[1072,63,"NSW"]
[1073,63,"NSW"]
[1074,63,"NSW"]
[1075,63,"NSW"]
[1076,63,"NSW"]
[1077,63,"NSW"]
[1078,63,"NSW"]
[1079,63,"NSW"]
[1080,63,"NSW"]
[1081,63,"NSW"]
[1082,63,"NSW"]
[1083,63,"NSW"]
[1084,63,"NSW"]
[1085,63,"NSW"]
[1086,63,"NSW"]
[1087,63,"NSW"]
[1088,63,"NSW"]
[1089,63,"NSW"]
[1090,63,{"$f":"IF(OR(A194<=299,AND(A194<3000,A194>=1000)),\"NSW\",IF(AND(A194<=999,A194>=800),\"NT\",IF(OR(AND(A194<=8999,A194>=8000),AND(A194<=3999,A194>=3000)),\"VIC\",IF(OR(AND(A194<=9999,A194>=9000),AND(A194<=4999,A194>=4000)),\"QLD\",IF(AND(A194<=5999,A194>=5000),\"SA\",IF(AND(A194<=6999,A194>=6000),\"WA\",\"TAS\"))))))","v":"NSW"}]
[1091,63,"NSW"]
[1092,63,"NSW"]
[1093,63,"NSW"]
[1094,63,"NSW"]
[1095,63,"NSW"]
[1096,63,"NSW"]
[1097,63,"NSW"]
[1098,63,"NSW"]
[1099,63,"NSW"]
[1100,63,"NSW"]
[1101,63,"NSW"]
[1102,63,"NSW"]
[1103,63,"NSW"]
[1104,63,"NSW"]
[1105,63,"NSW"]
[1106,63,"NSW"]
[1107,63,"NSW"]
[1108,63,"NSW"]
[1109,63,"NSW"]
[1110,63,"NSW"]
[1112,63,"NSW"]
[1113,63,"NSW"]
[1114,63,"NSW"]
[1115,63,"NSW"]
[1116,63,"NSW"]
[1118,63,"NSW"]
[1119,63,"NSW"]
[1120,63,"NSW"]
[1121,63,"NSW"]
[1122,63,"NSW"]
[1123,63,"NSW"]
[1124,63,"NSW"]
[1125,63,"NSW"]
[1126,63,"NSW"]
[1127,63,"NSW"]
[1128,63,"NSW"]
[1129,63,"NSW"]
[1130,63,"NSW"]
[1131,63,"NSW"]
[1132,63,"NSW"]
[1133,63,"NSW"]
[1134,63,"NSW"]
[1135,63,"NSW"]
[1136,63,"NSW"]
[1137,63,"NSW"]
[1138,63,"NSW"]
[1139,63,"NSW"]
[1140,63,"NSW"]
[1141,63,"NSW"]
[1142,63,"NSW"]
[1143,63,"NSW"]
[1144,63,"NSW"]
[1145,63,"NSW"]
[1146,63,"NSW"]
[1147,63,"NSW"]
[1148,63,"NSW"]
[1149,63,"NSW"]
[1150,63,"NSW"]
[1151,63,"NSW"]
[1152,63,"NSW"]
[1153,63,"NSW"]
[1154,63,"NSW"]
[1155,63,"NSW"]
[1156,63,{"$f":"IF(OR(A258<=299,AND(A258<3000,A258>=1000)),\"NSW\",IF(AND(A258<=999,A258>=800),\"NT\",IF(OR(AND(A258<=8999,A258>=8000),AND(A258<=3999,A258>=3000)),\"VIC\",IF(OR(AND(A258<=9999,A258>=9000),AND(A258<=4999,A258>=4000)),\"QLD\",IF(AND(A258<=5999,A258>=5000),\"SA\",IF(AND(A258<=6999,A258>=6000),\"WA\",\"TAS\"))))))","v":"NSW"}]
[1157,63,"NSW"]
[1158,63,"NSW"]
[1159,63,"NSW"]
[1160,63,"NSW"]
[1161,63,"NSW"]
[1162,63,"NSW"]
[1163,63,"NSW"]
[1164,63,"NSW"]
[1165,63,"NSW"]
[1166,63,"NSW"]
[1167,63,"NSW"]
[1168,63,"NSW"]
[1169,63,"NSW"]
[1170,63,"NSW"]
[1171,63,"NSW"]
[1172,63,"NSW"]
[1173,63,"NSW"]
[1174,63,"NSW"]
[1175,63,"NSW"]
[1176,63,"NSW"]
[1177,63,"NSW"]
[1178,63,"NSW"]
[1179,63,"NSW"]
[1180,63,"NSW"]
[1181,63,"NSW"]
[1182,63,"NSW"]
[1183,63,"NSW"]
[1184,63,"NSW"]
[1185,63,"NSW"]
[1186,63,"NSW"]
[1187,63,"NSW"]
[1188,63,"NSW"]
[1189,63,"NSW"]
[1190,63,"NSW"]
[1191,63,"NSW"]
[1192,63,"NSW"]
[1193,63,"NSW"]
[1194,63,"NSW"]
[1195,63,"NSW"]
[1196,63,"NSW"]
[1197,63,"NSW"]
[1198,63,"NSW"]
[1199,63,"NSW"]
[1200,63,"NSW"]
[1201,63,"NSW"]
[1202,63,"NSW"]
[1203,63,"NSW"]
[1204,63,"NSW"]
[1205,63,"NSW"]
[1206,63,"NSW"]
[1207,63,"NSW"]
[1208,63,"NSW"]
[1209,63,"NSW"]
[1210,63,"NSW"]
[1211,63,"NSW"]
[1212,63,"NSW"]
[1213,63,"NSW"]
[1214,63,"NSW"]
[1215,63,"NSW"]
[1216,63,"NSW"]
[1217,63,"NSW"]
[1218,63,"NSW"]
[1219,63,"NSW"]
[1220,63,{"$f":"IF(OR(A322<=299,AND(A322<3000,A322>=1000)),\"NSW\",IF(AND(A322<=999,A322>=800),\"NT\",IF(OR(AND(A322<=8999,A322>=8000),AND(A322<=3999,A322>=3000)),\"VIC\",IF(OR(AND(A322<=9999,A322>=9000),AND(A322<=4999,A322>=4000)),\"QLD\",IF(AND(A322<=5999,A322>=5000),\"SA\",IF(AND(A322<=6999,A322>=6000),\"WA\",\"TAS\"))))))","v":"NSW"}]
[1221,63,"NSW"]
[1222,63,"NSW"]
[1223,63,"NSW"]
[1224,63,"NSW"]
[1225,63,"NSW"]
[1226,63,"NSW"]
[1227,63,"NSW"]
[1228,63,"NSW"]
[1229,63,"NSW"]
[1230,63,"NSW"]
[1231,63,"NSW"]
[1232,63,"NSW"]
[1233,63,"NSW"]
[1234,63,"NSW"]
[1235,63,"NSW"]
[1236,63,"NSW"]
[1237,63,"NSW"]
[1238,63,"NSW"]
[1239,63,"NSW"]
[1240,63,"NSW"]
[1241,63,"NSW"]
[1242,63,"NSW"]
[1243,63,"NSW"]
[1244,63,"NSW"]
[1245,63,"NSW"]
[1246,63,"NSW"]
[1247,63,"NSW"]
[1248,63,"NSW"]
[1249,63,"NSW"]
[1250,63,"NSW"]
[1251,63,"NSW"]
[1252,63,"NSW"]
[1253,63,"NSW"]
[1254,63,"NSW"]
[1255,63,"NSW"]
[1256,63,"NSW"]
[1257,63,"NSW"]
[1258,63,"NSW"]
[1259,63,"NSW"]
[1260,63,"NSW"]
[1262,63,"NSW"]
[1263,63,"NSW"]
[1264,63,"NSW"]
[1265,63,"NSW"]
[1266,63,"NSW"]
[1267,63,"NSW"]
[1268,63,"NSW"]
[1269,63,"NSW"]
[1270,63,"NSW"]
[1272,63,"NSW"]
[1273,63,"NSW"]
[1274,63,"NSW"]
[1275,63,"NSW"]
[1276,63,"NSW"]
[1277,63,"NSW"]
[1278,63,"NSW"]
[1279,63,"NSW"]
[1280,63,"NSW"]
[1281,63,"NSW"]
[1282,63,"NSW"]
[1283,63,"NSW"]
[1284,63,"NSW"]
[1285,63,"NSW"]
[1286,63,{"$f":"IF(OR(A386<=299,AND(A386<3000,A386>=1000)),\"NSW\",IF(AND(A386<=999,A386>=800),\"NT\",IF(OR(AND(A386<=8999,A386>=8000),AND(A386<=3999,A386>=3000)),\"VIC\",IF(OR(AND(A386<=9999,A386>=9000),AND(A386<=4999,A386>=4000)),\"QLD\",IF(AND(A386<=5999,A386>=5000),\"SA\",IF(AND(A386<=6999,A386>=6000),\"WA\",\"TAS\"))))))","v":"NSW"}]
[1287,63,"NSW"]
[1288,63,"NSW"]
[1289,63,"NSW"]
[1290,63,"NSW"]
[1291,63,"NSW"]
[1292,63,"NSW"]
[1293,63,"NSW"]
[1294,63,"NSW"]
[1295,63,"NSW"]
[1296,63,"NSW"]
[1297,63,"NSW"]
[1298,63,"NSW"]
[1299,63,"NSW"]
[1300,63,"NSW"]
[1301,63,"NSW"]
[1302,63,"NSW"]
[1303,63,"NSW"]
[1304,63,"NSW"]
[1305,63,"NSW"]
[1306,63,"NSW"]
[1307,63,"NSW"]
[1308,63,"NSW"]
[1309,63,"NSW"]
[1310,63,"NSW"]
[1311,63,"NSW"]
[1312,63,"NSW"]
[1313,63,"NSW"]
[1314,63,"NSW"]
[1315,63,"NSW"]
[1316,63,"NSW"]
[1317,63,"NSW"]
[1318,63,"NSW"]
[1319,63,"NSW"]
[1320,63,"NSW"]
[1321,63,"NSW"]
[1322,63,"NSW"]
[1323,63,"NSW"]
[1324,63,"NSW"]
[1325,63,"NSW"]
[1326,63,"NSW"]
[1327,63,"NSW"]
[1328,63,"NSW"]
[1329,63,"NSW"]
[1330,63,"NSW"]
[1331,63,"NSW"]
[1332,63,"NSW"]
[1333,63,"NSW"]
[1334,63,"NSW"]
[1335,63,"NSW"]
[1336,63,"NSW"]
[1337,63,"NSW"]
[1338,63,"NSW"]
[1339,63,"NSW"]
[1340,63,"NSW"]
[1341,63,"NSW"]
[1342,63,"NSW"]
[1343,63,"NSW"]
[1344,63,"NSW"]
[1345,63,"NSW"]
[1346,63,"NSW"]
[1347,63,"NSW"]
[1348,63,"NSW"]
[1349,63,"NSW"]
[1350,63,{"$f":"IF(OR(A450<=299,AND(A450<3000,A450>=1000)),\"NSW\",IF(AND(A450<=999,A450>=800),\"NT\",IF(OR(AND(A450<=8999,A450>=8000),AND(A450<=3999,A450>=3000)),\"VIC\",IF(OR(AND(A450<=9999,A450>=9000),AND(A450<=4999,A450>=4000)),\"QLD\",IF(AND(A450<=5999,A450>=5000),\"SA\",IF(AND(A450<=6999,A450>=6000),\"WA\",\"TAS\"))))))","v":"NSW"}]
[1355,63,"NSW"]
[1356,63,"NSW"]
[1357,63,"NSW"]
[1358,63,"NSW"]
[1359,63,"NSW"]
[1360,63,"NSW"]
[1362,63,"NSW"]
[1363,63,"NSW"]
[1400,63,"NSW"]
[1401,63,"NSW"]
[1402,63,"NSW"]
[1403,63,"NSW"]
[1404,63,"NSW"]
[1405,63,"NSW"]
[1406,63,"NSW"]
[1407,63,"NSW"]
[1408,63,"NSW"]
[1409,63,"NSW"]
[1410,63,"NSW"]
[1411,63,"NSW"]
[1412,63,"NSW"]
[1413,63,"NSW"]
[1414,63,"NSW"]
[1415,63,"NSW"]
[1416,63,"NSW"]
[1417,63,"NSW"]
[1418,63,"NSW"]
[1419,63,"NSW"]
[1420,63,"NSW"]
[1421,63,"NSW"]
[1422,63,"NSW"]
[1423,63,"NSW"]
[1424,63,"NSW"]
[1425,63,"NSW"]
[1426,63,"NSW"]
[1427,63,"NSW"]
[1428,63,"NSW"]
[1429,63,"NSW"]
[1430,63,"NSW"]
[1431,63,"NSW"]
[1432,63,"NSW"]
[1433,63,"NSW"]
[1434,63,"NSW"]
[1435,63,"NSW"]
[1436,63,"NSW"]
[1437,63,"NSW"]
[1438,63,"NSW"]
[1439,63,"NSW"]
[1440,63,"NSW"]
[1441,63,"NSW"]
[1442,63,"NSW"]
[1443,63,"NSW"]
[1444,63,"NSW"]
[1445,63,"NSW"]
[1450,63,"NSW"]
[1452,63,"NSW"]
[1453,63,"NSW"]
[1454,63,"NSW"]
[1455,63,"NSW"]
[1456,63,"NSW"]
[1457,63,"NSW"]
[1458,63,"NSW"]
[1459,63,"NSW"]
[1460,63,{"$f":"IF(OR(A514<=299,AND(A514<3000,A514>=1000)),\"NSW\",IF(AND(A514<=999,A514>=800),\"NT\",IF(OR(AND(A514<=8999,A514>=8000),AND(A514<=3999,A514>=3000)),\"VIC\",IF(OR(AND(A514<=9999,A514>=9000),AND(A514<=4999,A514>=4000)),\"QLD\",IF(AND(A514<=5999,A514>=5000),\"SA\",IF(AND(A514<=6999,A514>=6000),\"WA\",\"TAS\"))))))","v":"NSW"}]
[1461,63,"NSW"]
[1462,63,"NSW"]
[1463,63,"NSW"]
[1465,63,"NSW"]
[1467,63,"NSW"]
[1468,63,"NSW"]
[1470,63,"NSW"]
[1472,63,"NSW"]
[1474,63,"NSW"]
[1475,63,"NSW"]
[1476,63,"NSW"]
[1477,63,"NSW"]
[1478,63,"NSW"]
[1479,63,"NSW"]
[1480,63,"NSW"]
[1481,63,"NSW"]
[1482,63,"NSW"]
[1484,63,"NSW"]
[1485,63,"NSW"]
[1487,63,"NSW"]
[1490,63,"NSW"]
[1493,63,"NSW"]
[1495,63,"NSW"]
[1499,63,"NSW"]
[1502,63,"NSW"]
[1503,63,"NSW"]
[1504,63,"NSW"]
[1505,63,"NSW"]
[1506,63,"NSW"]
[1507,63,"NSW"]
[1508,63,"NSW"]
[1509,63,"NSW"]
[1510,63,"NSW"]
[1511,63,"NSW"]
[1515,63,"NSW"]
[1516,63,"NSW"]
[1517,63,"NSW"]
[1544,63,"NSW"]
[1545,63,"NSW"]
[1546,63,"NSW"]
[1547,63,"NSW"]
[1549,63,"NSW"]
[1550,63,"NSW"]
[1551,63,"NSW"]
[1552,63,"NSW"]
[1553,63,"NSW"]
[1554,63,"NSW"]
[1555,63,"NSW"]
[1556,63,"NSW"]
[1557,63,"NSW"]
[1558,63,"NSW"]
[1559,63,"NSW"]
[1560,63,"NSW"]
[1565,63,"NSW"]
[1570,63,"NSW"]
[1571,63,"NSW"]
[1581,63,"NSW"]
[1582,63,"NSW"]
[1583,63,"NSW"]
[1584,63,"NSW"]
[1585,63,"NSW"]
[1586,63,"NSW"]
[1587,63,"NSW"]
[1588,63,{"$f":"IF(OR(A578<=299,AND(A578<3000,A578>=1000)),\"NSW\",IF(AND(A578<=999,A578>=800),\"NT\",IF(OR(AND(A578<=8999,A578>=8000),AND(A578<=3999,A578>=3000)),\"VIC\",IF(OR(AND(A578<=9999,A578>=9000),AND(A578<=4999,A578>=4000)),\"QLD\",IF(AND(A578<=5999,A578>=5000),\"SA\",IF(AND(A578<=6999,A578>=6000),\"WA\",\"TAS\"))))))","v":"NSW"}]
[1589,63,"NSW"]
[1590,63,"NSW"]
[1595,63,"NSW"]
[1596,63,"NSW"]
[1597,63,"NSW"]
[1598,63,"NSW"]
[1599,63,"NSW"]
[1600,63,"NSW"]
[1601,63,"NSW"]
[1602,63,"NSW"]
[1603,63,"NSW"]
[1604,63,"NSW"]
[1605,63,"NSW"]
[1606,63,"NSW"]
[1607,63,"NSW"]
[1608,63,"NSW"]
[1609,63,"NSW"]
[1610,63,"NSW"]
[1611,63,"NSW"]
[1627,63,"NSW"]
[1628,63,"NSW"]
[1629,63,"NSW"]
[1630,63,"NSW"]
[1631,63,"NSW"]
[1632,63,"NSW"]
[1633,63,"NSW"]
[1635,63,"NSW"]
[1636,63,"NSW"]
[1639,63,"NSW"]
[1640,63,"NSW"]
[1646,63,"NSW"]
[1648,63,"NSW"]
[1650,63,"NSW"]
[1651,63,"NSW"]
[1652,63,"NSW"]
[1653,63,"NSW"]
[1654,63,"NSW"]
[1655,63,"NSW"]
[1656,63,"NSW"]
[1657,63,"NSW"]
[1658,63,"NSW"]
[1659,63,"NSW"]
[1660,63,"NSW"]
[1670,63,"NSW"]
[1671,63,"NSW"]
[1672,63,"NSW"]
[1673,63,"NSW"]
[1674,63,"NSW"]
[1675,63,"NSW"]
[1676,63,"NSW"]
[1677,63,"NSW"]
[1678,63,"NSW"]
[1679,63,"NSW"]
[1680,63,"NSW"]
[1681,63,"NSW"]
[1682,63,"NSW"]
[1683,63,"NSW"]
[1684,63,"NSW"]
[1685,63,"NSW"]
[1686,63,"NSW"]
[1687,63,"NSW"]
[1688,63,"NSW"]
[1689,63,"NSW"]
[1690,63,{"$f":"IF(OR(A642<=299,AND(A642<3000,A642>=1000)),\"NSW\",IF(AND(A642<=999,A642>=800),\"NT\",IF(OR(AND(A642<=8999,A642>=8000),AND(A642<=3999,A642>=3000)),\"VIC\",IF(OR(AND(A642<=9999,A642>=9000),AND(A642<=4999,A642>=4000)),\"QLD\",IF(AND(A642<=5999,A642>=5000),\"SA\",IF(AND(A642<=6999,A642>=6000),\"WA\",\"TAS\"))))))","v":"NSW"}]
[1691,63,"NSW"]
[1692,63,"NSW"]
[1693,63,"NSW"]
[1694,63,"NSW"]
[1695,63,"NSW"]
[1696,63,"NSW"]
[1697,63,"NSW"]
[1698,63,"NSW"]
[1699,63,"NSW"]
[1700,63,"NSW"]
[1701,63,"NSW"]
[1707,63,"NSW"]
[1708,63,"NSW"]
[1709,63,"NSW"]
[1710,63,"NSW"]
[1711,63,"NSW"]
[1712,63,"NSW"]
[1713,63,"NSW"]
[1714,63,"NSW"]
[1715,63,"NSW"]
[1725,63,"NSW"]
[1726,63,"NSW"]
[1727,63,"NSW"]
[1728,63,"NSW"]
[1730,63,"NSW"]
[1738,63,"NSW"]
[1739,63,"NSW"]
[1740,63,"NSW"]
[1741,63,"NSW"]
[1742,63,"NSW"]
[1743,63,"NSW"]
[1744,63,"NSW"]
[1745,63,"NSW"]
[1746,63,"NSW"]
[1747,63,"NSW"]
[1748,63,"NSW"]
[1749,63,"NSW"]
[1750,63,"NSW"]
[1755,63,"NSW"]
[1764,63,"NSW"]
[1765,63,"NSW"]
[1771,63,"NSW"]
[1772,63,"NSW"]
[1773,63,"NSW"]
[1774,63,"NSW"]
[1775,63,"NSW"]
[1776,63,"NSW"]
[1777,63,"NSW"]
[1778,63,"NSW"]
[1779,63,"NSW"]
[1780,63,"NSW"]
[1781,63,"NSW"]
[1783,63,"NSW"]
[1784,63,"NSW"]
[1785,63,"NSW"]
[1786,63,"NSW"]
[1787,63,"NSW"]
[1788,63,"NSW"]
[1789,63,"NSW"]
[1790,63,"NSW"]
[1795,63,"NSW"]
[1796,63,"NSW"]
[1797,63,"NSW"]
[1798,63,{"$f":"IF(OR(A706<=299,AND(A706<3000,A706>=1000)),\"NSW\",IF(AND(A706<=999,A706>=800),\"NT\",IF(OR(AND(A706<=8999,A706>=8000),AND(A706<=3999,A706>=3000)),\"VIC\",IF(OR(AND(A706<=9999,A706>=9000),AND(A706<=4999,A706>=4000)),\"QLD\",IF(AND(A706<=5999,A706>=5000),\"SA\",IF(AND(A706<=6999,A706>=6000),\"WA\",\"TAS\"))))))","v":"NSW"}]
[1800,63,"NSW"]
[1801,63,"NSW"]
[1802,63,"NSW"]
[1803,63,"NSW"]
[1804,63,"NSW"]
[1805,63,"NSW"]
[1806,63,"NSW"]
[1807,63,"NSW"]
[1808,63,"NSW"]
[1809,63,"NSW"]
[1811,63,"NSW"]
[1812,63,"NSW"]
[1813,63,"NSW"]
[1814,63,"NSW"]
[1815,63,"NSW"]
[1816,63,"NSW"]
[1817,63,"NSW"]
[1818,63,"NSW"]
[1819,63,"NSW"]
[1820,63,"NSW"]
[1821,63,"NSW"]
[1822,63,"NSW"]
[1823,63,"NSW"]
[1824,63,"NSW"]
[1825,63,"NSW"]
[1826,63,"NSW"]
[1827,63,"NSW"]
[1828,63,"NSW"]
[1829,63,"NSW"]
[1830,63,"NSW"]
[1831,63,"NSW"]
[1832,63,"NSW"]
[1833,63,"NSW"]
[1834,63,"NSW"]
[1835,63,"NSW"]
[1836,63,"NSW"]
[1837,63,"NSW"]
[1838,63,"NSW"]
[1839,63,"NSW"]
[1842,63,"NSW"]
[1843,63,"NSW"]
[1844,63,"NSW"]
[1845,63,"NSW"]
[1846,63,"NSW"]
[1847,63,"NSW"]
[1848,63,"NSW"]
[1849,63,"NSW"]
[1850,63,"NSW"]
[1851,63,"NSW"]
[1852,63,"NSW"]
[1853,63,"NSW"]
[1854,63,"NSW"]
[1855,63,"NSW"]
[1856,63,"NSW"]
[1857,63,"NSW"]
[1858,63,"NSW"]
[1859,63,"NSW"]
[1860,63,"NSW"]
[1861,63,"NSW"]
[1862,63,"NSW"]
[1863,63,"NSW"]
[1864,63,"NSW"]
[1867,63,"NSW"]
[1868,63,{"$f":"IF(OR(A770<=299,AND(A770<3000,A770>=1000)),\"NSW\",IF(AND(A770<=999,A770>=800),\"NT\",IF(OR(AND(A770<=8999,A770>=8000),AND(A770<=3999,A770>=3000)),\"VIC\",IF(OR(AND(A770<=9999,A770>=9000),AND(A770<=4999,A770>=4000)),\"QLD\",IF(AND(A770<=5999,A770>=5000),\"SA\",IF(AND(A770<=6999,A770>=6000),\"WA\",\"TAS\"))))))","v":"NSW"}]
[1869,63,"NSW"]
[1870,63,"NSW"]
[1871,63,"NSW"]
[1872,63,"NSW"]
[1873,63,"NSW"]
[1874,63,"NSW"]
[1875,63,"NSW"]
[1876,63,"NSW"]
[1877,63,"NSW"]
[1878,63,"NSW"]
[1879,63,"NSW"]
[1880,63,"NSW"]
[1881,63,"NSW"]
[1882,63,"NSW"]
[1883,63,"NSW"]
[1884,63,"NSW"]
[1885,63,"NSW"]
[1886,63,"NSW"]
[1887,63,"NSW"]
[1888,63,"NSW"]
[1890,63,"NSW"]
[1891,63,"NSW"]
[1894,63,"NSW"]
[1895,63,"NSW"]
[1896,63,"NSW"]
[1897,63,"NSW"]
[1898,63,"NSW"]
[1900,63,"NSW"]
[1902,63,"NSW"]
[1903,63,"NSW"]
[1920,63,"NSW"]
[2000,63,"NSW"]
[2001,63,"NSW"]
[2004,63,"NSW"]
[2005,63,"NSW"]
[2006,63,"NSW"]
[2007,63,"NSW"]
[2008,63,"NSW"]
[2009,63,"NSW"]
[2010,63,"NSW"]
[2011,63,"NSW"]
[2012,63,"NSW"]
[2013,63,"NSW"]
[2014,63,"NSW"]
[2015,63,"NSW"]
[2016,63,"NSW"]
[2017,63,"NSW"]
[2018,63,"NSW"]
[2019,63,"NSW"]
[2020,63,"NSW"]
[2021,63,"NSW"]
[2022,63,"NSW"]
[2023,63,"NSW"]
[2024,63,"NSW"]
[2025,63,"NSW"]
[2026,63,"NSW"]
[2027,63,"NSW"]
[2028,63,"NSW"]
[2029,63,"NSW"]
[2030,63,"NSW"]
[2031,63,"NSW"]
[2032,63,"NSW"]
[2033,63,"NSW"]
[2034,63,{"$f":"IF(OR(A834<=299,AND(A834<3000,A834>=1000)),\"NSW\",IF(AND(A834<=999,A834>=800),\"NT\",IF(OR(AND(A834<=8999,A834>=8000),AND(A834<=3999,A834>=3000)),\"VIC\",IF(OR(AND(A834<=9999,A834>=9000),AND(A834<=4999,A834>=4000)),\"QLD\",IF(AND(A834<=5999,A834>=5000),\"SA\",IF(AND(A834<=6999,A834>=6000),\"WA\",\"TAS\"))))))","v":"NSW"}]
[2035,63,"NSW"]
[2036,63,"NSW"]
[2037,63,"NSW"]
[2038,63,"NSW"]
[2039,63,"NSW"]
[2040,63,"NSW"]
[2041,63,"NSW"]
[2042,63,"NSW"]
[2043,63,"NSW"]
[2044,63,"NSW"]
[2045,63,"NSW"]
[2046,63,"NSW"]
[2047,63,"NSW"]
[2048,63,"NSW"]
[2049,63,"NSW"]
[2050,63,"NSW"]
[2051,63,"NSW"]
[2052,63,"NSW"]
[2055,63,"NSW"]
[2056,63,"NSW"]
[2057,63,"NSW"]
[2058,63,"NSW"]
[2059,63,"NSW"]
[2060,63,"NSW"]
[2061,63,"NSW"]
[2062,63,"NSW"]
[2063,63,"NSW"]
[2064,63,"NSW"]
[2065,63,"NSW"]
[2066,63,"NSW"]
[2067,63,"NSW"]
[2068,63,"NSW"]
[2069,63,"NSW"]
[2070,63,"NSW"]
[2071,63,"NSW"]
[2072,63,"NSW"]
[2073,63,"NSW"]
[2074,63,"NSW"]
[2075,63,"NSW"]
[2076,63,"NSW"]
[2077,63,"NSW"]
[2079,63,"NSW"]
[2080,63,"NSW"]
[2081,63,"NSW"]
[2082,63,"NSW"]
[2083,63,"NSW"]
[2084,63,"NSW"]
[2085,63,"NSW"]
[2086,63,"NSW"]
[2087,63,"NSW"]
[2088,63,"NSW"]
[2089,63,"NSW"]
[2090,63,"NSW"]
[2091,63,"NSW"]
[2092,63,"NSW"]
[2093,63,"NSW"]
[2094,63,"NSW"]
[2095,63,"NSW"]
[2096,63,"NSW"]
[2097,63,"NSW"]
[2099,63,"NSW"]
[2100,63,"NSW"]
[2101,63,"NSW"]
[2102,63,{"$f":"IF(OR(A898<=299,AND(A898<3000,A898>=1000)),\"NSW\",IF(AND(A898<=999,A898>=800),\"NT\",IF(OR(AND(A898<=8999,A898>=8000),AND(A898<=3999,A898>=3000)),\"VIC\",IF(OR(AND(A898<=9999,A898>=9000),AND(A898<=4999,A898>=4000)),\"QLD\",IF(AND(A898<=5999,A898>=5000),\"SA\",IF(AND(A898<=6999,A898>=6000),\"WA\",\"TAS\"))))))","v":"NSW"}]
[2103,63,"NSW"]
[2104,63,"NSW"]
[2105,63,"NSW"]
[2106,63,"NSW"]
[2107,63,"NSW"]
[2108,63,"NSW"]
[2109,63,"NSW"]
[2110,63,"NSW"]
[2111,63,"NSW"]
[2112,63,"NSW"]
[2113,63,"NSW"]
[2114,63,"NSW"]
[2115,63,"NSW"]
[2116,63,"NSW"]
[2117,63,"NSW"]
[2118,63,"NSW"]
[2119,63,"NSW"]
[2120,63,"NSW"]
[2121,63,"NSW"]
[2122,63,"NSW"]
[2123,63,"NSW"]
[2124,63,"NSW"]
[2125,63,"NSW"]
[2126,63,"NSW"]
[2127,63,"NSW"]
[2128,63,"NSW"]
[2129,63,"NSW"]
[2130,63,"NSW"]
[2131,63,"NSW"]
[2132,63,"NSW"]
[2133,63,"NSW"]
[2134,63,"NSW"]
[2135,63,"NSW"]
[2136,63,"NSW"]
[2137,63,"NSW"]
[2138,63,"NSW"]
[2139,63,"NSW"]
[2140,63,"NSW"]
[2141,63,"NSW"]
[2142,63,"NSW"]
[2143,63,"NSW"]
[2144,63,"NSW"]
[2145,63,"NSW"]
[2146,63,"NSW"]
[2147,63,"NSW"]
[2148,63,"NSW"]
[2150,63,"NSW"]
[2151,63,"NSW"]
[2152,63,"NSW"]
[2153,63,"NSW"]
[2154,63,"NSW"]
[2155,63,"NSW"]
[2156,63,"NSW"]
[2157,63,"NSW"]
[2158,63,"NSW"]
[2159,63,"NSW"]
[2160,63,"NSW"]
[2161,63,"NSW"]
[2162,63,"NSW"]
[2163,63,"NSW"]
[2164,63,"NSW"]
[2165,63,"NSW"]
[2166,63,"NSW"]
[2167,63,{"$f":"IF(OR(A962<=299,AND(A962<3000,A962>=1000)),\"NSW\",IF(AND(A962<=999,A962>=800),\"NT\",IF(OR(AND(A962<=8999,A962>=8000),AND(A962<=3999,A962>=3000)),\"VIC\",IF(OR(AND(A962<=9999,A962>=9000),AND(A962<=4999,A962>=4000)),\"QLD\",IF(AND(A962<=5999,A962>=5000),\"SA\",IF(AND(A962<=6999,A962>=6000),\"WA\",\"TAS\"))))))","v":"NSW"}]
[2168,63,"NSW"]
[2169,63,"NSW"]
[2170,63,"NSW"]
[2171,63,"NSW"]
[2173,63,"NSW"]
[2174,63,"NSW"]
[2176,63,"NSW"]
[2177,63,"NSW"]
[2190,63,"NSW"]
[2191,63,"NSW"]
[2192,63,"NSW"]
[2193,63,"NSW"]
[2194,63,"NSW"]
[2195,63,"NSW"]
[2196,63,"NSW"]
[2197,63,"NSW"]
[2198,63,"NSW"]
[2199,63,"NSW"]
[2200,63,"NSW"]
[2201,63,"NSW"]
[2202,63,"NSW"]
[2203,63,"NSW"]
[2204,63,"NSW"]
[2205,63,"NSW"]
[2206,63,"NSW"]
[2207,63,"NSW"]
[2208,63,"NSW"]
[2209,63,"NSW"]
[2210,63,"NSW"]
[2211,63,"NSW"]
[2212,63,"NSW"]
[2213,63,"NSW"]
[2214,63,"NSW"]
[2215,63,"NSW"]
[2216,63,"NSW"]
[2217,63,"NSW"]
[2218,63,"NSW"]
[2219,63,"NSW"]
[2220,63,"NSW"]
[2221,63,"NSW"]
[2222,63,"NSW"]
[2223,63,"NSW"]
[2224,63,"NSW"]
[2225,63,"NSW"]
[2226,63,"NSW"]
[2227,63,"NSW"]
[2228,63,"NSW"]
[2229,63,"NSW"]
[2230,63,"NSW"]
[2231,63,"NSW"]
[2232,63,"NSW"]
[2233,63,"NSW"]
[2234,63,"NSW"]
[2250,61,"NSW"]
[2251,61,"NSW"]
[2252,61,"NSW"]
[2256,61,"NSW"]
[2257,61,"NSW"]
[2258,61,"NSW"]
[2259,61,"NSW"]
[2260,61,"NSW"]
[2261,61,"NSW"]
[2262,61,"NSW"]
[2263,61,{"$f":"IF(OR(A1026<=299,AND(A1026<3000,A1026>=1000)),\"NSW\",IF(AND(A1026<=999,A1026>=800),\"NT\",IF(OR(AND(A1026<=8999,A1026>=8000),AND(A1026<=3999,A1026>=3000)),\"VIC\",IF(OR(AND(A1026<=9999,A1026>=9000),AND(A1026<=4999,A1026>=4000)),\"QLD\",IF(AND(A1026<=5999,A1026>=5000),\"SA\",IF(AND(A1026<=6999,A1026>=6000),\"WA\",\"TAS\"))))))","v":"NSW"}]
[2264,61,"NSW"]
[2265,61,"NSW"]
[2267,61,"NSW"]
[2278,61,"NSW"]
[2280,61,"NSW"]
[2281,61,"NSW"]
[2282,61,"NSW"]
[2283,61,"NSW"]
[2284,61,"NSW"]
[2285,61,"NSW"]
[2286,61,"NSW"]
[2287,61,"NSW"]
[2289,61,"NSW"]
[2290,61,"NSW"]
[2291,61,"NSW"]
[2292,61,"NSW"]
[2293,61,"NSW"]
[2294,61,"NSW"]
[2295,61,"NSW"]
[2296,61,"NSW"]
[2297,61,"NSW"]
[2298,61,"NSW"]
[2299,61,"NSW"]
[2300,61,"NSW"]
[2302,61,"NSW"]
[2303,61,"NSW"]
[2304,61,"NSW"]
[2305,61,"NSW"]
[2306,61,"NSW"]
[2307,61,"NSW"]
[2308,61,"NSW"]
[2309,61,"NSW"]
[2310,61,"NSW"]
[2311,61,"NSW"]
[2312,61,"NSW"]
[2314,61,"NSW"]
[2315,61,"NSW"]
[2316,61,"NSW"]
[2317,61,"NSW"]
[2318,61,"NSW"]
[2319,61,"NSW"]
[2320,61,"NSW"]
[2321,61,"NSW"]
[2322,61,"NSW"]
[2323,61,"NSW"]
[2324,61,"NSW"]
[2325,61,"NSW"]
[2326,61,"NSW"]
[2327,61,"NSW"]
[2328,61,"NSW"]
[2329,61,"NSW"]
[2330,61,"NSW"]
[2331,61,"NSW"]
[2333,61,"NSW"]
[2334,61,"NSW"]
[2335,61,"NSW"]
[2336,61,"NSW"]
[2337,61,"NSW"]
[2338,61,"NSW"]
[2339,61,"NSW"]
[2340,55,"NSW"]
[2341,55,"NSW"]
[2342,55,"NSW"]
[2343,55,{"$f":"IF(OR(A1090<=299,AND(A1090<3000,A1090>=1000)),\"NSW\",IF(AND(A1090<=999,A1090>=800),\"NT\",IF(OR(AND(A1090<=8999,A1090>=8000),AND(A1090<=3999,A1090>=3000)),\"VIC\",IF(OR(AND(A1090<=9999,A1090>=9000),AND(A1090<=4999,A1090>=4000)),\"QLD\",IF(AND(A1090<=5999,A1090>=5000),\"SA\",IF(AND(A1090<=6999,A1090>=6000),\"WA\",\"TAS\"))))))","v":"NSW"}]
[2344,55,"NSW"]
[2345,55,"NSW"]
[2346,55,"NSW"]
[2347,55,"NSW"]
[2348,55,"NSW"]
[2350,59,"NSW"]
[2351,59,"NSW"]
[2352,55,"NSW"]
[2353,55,"NSW"]
[2354,59,"NSW"]
[2355,55,"NSW"]
[2356,56,"NSW"]
[2357,56,"NSW"]
[2358,59,"NSW"]
[2359,59,"NSW"]
[2360,59,"NSW"]
[2361,55,"NSW"]
[2365,59,"NSW"]
[2369,59,"NSW"]
[2370,59,"NSW"]
[2371,59,"NSW"]
[2372,59,"NSW"]
[2379,55,"NSW"]
[2380,55,"NSW"]
[2381,55,"NSW"]
[2382,55,"NSW"]
[2386,55,"NSW"]
[2387,55,"NSW"]
[2388,55,"NSW"]
[2390,55,"NSW"]
[2395,56,"NSW"]
[2396,55,"NSW"]
[2397,55,"NSW"]
[2398,55,"NSW"]
[2399,55,"NSW"]
[2400,55,"NSW"]
[2401,55,"NSW"]
[2402,55,"NSW"]
[2403,55,"NSW"]
[2404,55,"NSW"]
[2405,55,"NSW"]
[2406,55,"NSW"]
[2408,55,"NSW"]
[2409,55,"NSW"]
[2410,55,"NSW"]
[2411,55,"NSW"]
[2415,61,"NSW"]
[2420,61,"NSW"]
[2421,61,"NSW"]
[2422,60,"NSW"]
[2423,60,"NSW"]
[2424,60,"NSW"]
[2425,61,"NSW"]
[2426,60,"NSW"]
[2427,60,"NSW"]
[2428,60,"NSW"]
[2429,60,"NSW"]
[2430,60,"NSW"]
[2431,60,"NSW"]
[2439,60,"NSW"]
[2440,60,"NSW"]
[2441,60,"NSW"]
[2442,60,"NSW"]
[2443,60,{"$f":"IF(OR(A1154<=299,AND(A1154<3000,A1154>=1000)),\"NSW\",IF(AND(A1154<=999,A1154>=800),\"NT\",IF(OR(AND(A1154<=8999,A1154>=8000),AND(A1154<=3999,A1154>=3000)),\"VIC\",IF(OR(AND(A1154<=9999,A1154>=9000),AND(A1154<=4999,A1154>=4000)),\"QLD\",IF(AND(A1154<=5999,A1154>=5000),\"SA\",IF(AND(A1154<=6999,A1154>=6000),\"WA\",\"TAS\"))))))","v":"NSW"}]
[2444,60,"NSW"]
[2445,60,"NSW"]
[2446,60,"NSW"]
[2447,60,"NSW"]
[2448,60,"NSW"]
[2449,60,"NSW"]
[2450,60,"NSW"]
[2452,60,"NSW"]
[2453,60,"NSW"]
[2454,60,"NSW"]
[2455,60,"NSW"]
[2456,60,"NSW"]
[2460,58,"NSW"]
[2462,58,"NSW"]
[2463,58,"NSW"]
[2464,58,"NSW"]
[2465,58,"NSW"]
[2466,58,"NSW"]
[2468,58,"NSW"]
[2469,58,"NSW"]
[2470,58,"NSW"]
[2471,58,"NSW"]
[2472,58,"NSW"]
[2473,58,"NSW"]
[2474,58,"NSW"]
[2475,59,"NSW"]
[2476,59,"NSW"]
[2477,58,"NSW"]
[2478,58,"NSW"]
[2479,58,"NSW"]
[2480,58,"NSW"]
[2481,58,"NSW"]
[2482,58,"NSW"]
[2483,58,"NSW"]
[2484,58,"NSW"]
[2485,58,"NSW"]
[2486,58,"NSW"]
[2487,58,"NSW"]
[2488,58,"NSW"]
[2489,58,"NSW"]
[2490,58,"NSW"]
[2500,65,"NSW"]
[2502,65,"NSW"]
[2505,65,"NSW"]
[2506,65,"NSW"]
[2508,65,"NSW"]
[2515,65,"NSW"]
[2516,65,"NSW"]
[2517,65,"NSW"]
[2518,65,"NSW"]
[2519,65,"NSW"]
[2520,65,"NSW"]
[2521,65,"NSW"]
[2522,65,"NSW"]
[2525,65,"NSW"]
[2526,65,"NSW"]
[2527,65,"NSW"]
[2528,65,"NSW"]
[2529,65,"NSW"]
[2530,65,"NSW"]
[2533,65,"NSW"]
[2534,65,"NSW"]
[2535,65,"NSW"]
[2536,65,{"$f":"IF(OR(A1218<=299,AND(A1218<3000,A1218>=1000)),\"NSW\",IF(AND(A1218<=999,A1218>=800),\"NT\",IF(OR(AND(A1218<=8999,A1218>=8000),AND(A1218<=3999,A1218>=3000)),\"VIC\",IF(OR(AND(A1218<=9999,A1218>=9000),AND(A1218<=4999,A1218>=4000)),\"QLD\",IF(AND(A1218<=5999,A1218>=5000),\"SA\",IF(AND(A1218<=6999,A1218>=6000),\"WA\",\"TAS\"))))))","v":"NSW"}]
[2537,65,"NSW"]
[2538,65,"NSW"]
[2539,65,"NSW"]
[2540,65,"NSW"]
[2541,65,"NSW"]
[2545,65,"NSW"]
[2546,65,"NSW"]
[2548,65,"NSW"]
[2549,65,"NSW"]
[2550,65,"NSW"]
[2551,65,"NSW"]
[2558,63,"NSW"]
[2559,63,"NSW"]
[2560,63,"NSW"]
[2563,63,"NSW"]
[2564,63,"NSW"]
[2565,63,"NSW"]
[2566,63,"NSW"]
[2567,63,"NSW"]
[2568,63,"NSW"]
[2569,63,"NSW"]
[2570,63,"NSW"]
[2571,63,"NSW"]
[2572,63,"NSW"]
[2573,63,"NSW"]
[2574,63,"NSW"]
[2575,65,"NSW"]
[2576,65,"NSW"]
[2577,65,"NSW"]
[2578,65,"NSW"]
[2579,65,"NSW"]
[2580,64,"NSW"]
[2581,64,"NSW"]
[2582,64,"NSW"]
[2583,64,"NSW"]
[2584,57,"NSW"]
[2585,57,"NSW"]
[2586,57,"NSW"]
[2587,57,"NSW"]
[2588,57,"NSW"]
[2589,64,"NSW"]
[2590,57,"NSW"]
[2594,57,"NSW"]
[2600,64,"NSW"]
[2601,64,"NSW"]
[2602,64,"NSW"]
[2603,64,"NSW"]
[2604,64,"NSW"]
[2605,64,"NSW"]
[2606,64,"NSW"]
[2607,64,"NSW"]
[2608,64,"NSW"]
[2609,64,"NSW"]
[2610,64,"NSW"]
[2611,64,"NSW"]
[2612,64,"NSW"]
[2614,64,"NSW"]
[2615,64,"NSW"]
[2616,64,"NSW"]
[2617,64,"NSW"]
[2618,64,"NSW"]
[2619,64,"NSW"]
[2620,64,"NSW"]
[2621,64,{"$f":"IF(OR(A1282<=299,AND(A1282<3000,A1282>=1000)),\"NSW\",IF(AND(A1282<=999,A1282>=800),\"NT\",IF(OR(AND(A1282<=8999,A1282>=8000),AND(A1282<=3999,A1282>=3000)),\"VIC\",IF(OR(AND(A1282<=9999,A1282>=9000),AND(A1282<=4999,A1282>=4000)),\"QLD\",IF(AND(A1282<=5999,A1282>=5000),\"SA\",IF(AND(A1282<=6999,A1282>=6000),\"WA\",\"TAS\"))))))","v":"NSW"}]
[2622,64,"NSW"]
[2623,64,"NSW"]
[2624,57,"NSW"]
[2625,57,"NSW"]
[2626,64,"NSW"]
[2627,64,"NSW"]
[2628,64,"NSW"]
[2630,64,"NSW"]
[2631,64,"NSW"]
[2632,64,"NSW"]
[2633,64,"NSW"]
[2640,57,"NSW"]
[2641,57,"NSW"]
[2642,57,"NSW"]
[2643,57,"NSW"]
[2644,57,"NSW"]
[2645,54,"NSW"]
[2646,54,"NSW"]
[2647,54,"NSW"]
[2648,53,"NSW"]
[2649,57,"NSW"]
[2650,57,"NSW"]
[2651,57,"NSW"]
[2652,54,"NSW"]
[2653,57,"NSW"]
[2655,54,"NSW"]
[2656,54,"NSW"]
[2658,54,"NSW"]
[2659,54,"NSW"]
[2660,54,"NSW"]
[2661,54,"NSW"]
[2663,54,"NSW"]
[2665,54,"NSW"]
[2666,57,"NSW"]
[2668,57,"NSW"]
[2669,56,"NSW"]
[2671,56,"NSW"]
[2672,54,"NSW"]
[2675,54,"NSW"]
[2678,54,"NSW"]
[2680,54,"NSW"]
[2681,54,"NSW"]
[2700,54,"NSW"]
[2701,54,"NSW"]
[2702,54,"NSW"]
[2703,54,"NSW"]
[2705,54,"NSW"]
[2706,54,"NSW"]
[2707,54,"NSW"]
[2708,54,"NSW"]
[2710,54,"NSW"]
[2711,54,"NSW"]
[2712,54,"NSW"]
[2713,54,"NSW"]
[2714,54,"NSW"]
[2715,54,"NSW"]
[2716,54,"NSW"]
[2717,53,"NSW"]
[2720,57,"NSW"]
[2721,57,"NSW"]
[2722,57,"NSW"]
[2725,57,"NSW"]
[2726,57,"NSW"]
[2727,57,{"$f":"IF(OR(A1346<=299,AND(A1346<3000,A1346>=1000)),\"NSW\",IF(AND(A1346<=999,A1346>=800),\"NT\",IF(OR(AND(A1346<=8999,A1346>=8000),AND(A1346<=3999,A1346>=3000)),\"VIC\",IF(OR(AND(A1346<=9999,A1346>=9000),AND(A1346<=4999,A1346>=4000)),\"QLD\",IF(AND(A1346<=5999,A1346>=5000),\"SA\",IF(AND(A1346<=6999,A1346>=6000),\"WA\",\"TAS\"))))))","v":"NSW"}]
[2729,57,"NSW"]
[2730,57,"NSW"]
[2731,54,"NSW"]
[2732,54,"NSW"]
[2733,54,"NSW"]
[2734,54,"NSW"]
[2735,54,"NSW"]
[2736,54,"NSW"]
[2737,53,"NSW"]
[2738,53,"NSW"]
[2739,53,"NSW"]
[2740,63,"NSW"]
[2745,63,"NSW"]
[2746,63,"NSW"]
[2747,63,"NSW"]
[2748,63,"NSW"]
[2749,63,"NSW"]
[2750,63,"NSW"]
[2751,63,"NSW"]
[2752,63,"NSW"]
[2753,63,"NSW"]
[2754,63,"NSW"]
[2755,63,"NSW"]
[2756,63,"NSW"]
[2757,63,"NSW"]
[2758,63,"NSW"]
[2759,63,"NSW"]
[2760,63,"NSW"]
[2761,63,"NSW"]
[2762,63,"NSW"]
[2763,63,"NSW"]
[2764,63,"NSW"]
[2765,63,"NSW"]
[2766,63,"NSW"]
[2767,63,"NSW"]
[2768,63,"NSW"]
[2770,63,"NSW"]
[2773,63,"NSW"]
[2774,63,"NSW"]
[2775,63,"NSW"]
[2776,63,"NSW"]
[2777,63,"NSW"]
[2778,63,"NSW"]
[2779,63,"NSW"]
[2780,63,"NSW"]
[2781,63,"NSW"]
[2782,63,"NSW"]
[2783,63,"NSW"]
[2784,63,"NSW"]
[2785,63,"NSW"]
[2786,63,"NSW"]
[2787,62,"NSW"]
[2790,62,"NSW"]
[2791,62,"NSW"]
[2792,62,"NSW"]
[2793,62,"NSW"]
[2794,62,"NSW"]
[2795,62,"NSW"]
[2796,62,"NSW"]
[2797,62,"NSW"]
[2798,62,"NSW"]
[2799,62,"NSW"]
[2800,62,"NSW"]
[2803,56,{"$f":"IF(OR(A1410<=299,AND(A1410<3000,A1410>=1000)),\"NSW\",IF(AND(A1410<=999,A1410>=800),\"NT\",IF(OR(AND(A1410<=8999,A1410>=8000),AND(A1410<=3999,A1410>=3000)),\"VIC\",IF(OR(AND(A1410<=9999,A1410>=9000),AND(A1410<=4999,A1410>=4000)),\"QLD\",IF(AND(A1410<=5999,A1410>=5000),\"SA\",IF(AND(A1410<=6999,A1410>=6000),\"WA\",\"TAS\"))))))","v":"NSW"}]
[2804,62,"NSW"]
[2805,62,"NSW"]
[2806,56,"NSW"]
[2807,56,"NSW"]
[2808,62,"NSW"]
[2809,56,"NSW"]
[2810,56,"NSW"]
[2820,56,"NSW"]
[2821,56,"NSW"]
[2823,56,"NSW"]
[2824,56,"NSW"]
[2825,56,"NSW"]
[2826,56,"NSW"]
[2827,56,"NSW"]
[2828,56,"NSW"]
[2829,56,"NSW"]
[2830,56,"NSW"]
[2831,56,"NSW"]
[2832,55,"NSW"]
[2833,55,"NSW"]
[2834,52,"NSW"]
[2835,52,"NSW"]
[2836,52,"NSW"]
[2839,52,"NSW"]
[2840,52,"NSW"]
[2842,56,"NSW"]
[2843,56,"NSW"]
[2844,56,"NSW"]
[2845,62,"NSW"]
[2846,62,"NSW"]
[2847,62,"NSW"]
[2848,62,"NSW"]
[2849,62,"NSW"]
[2850,62,"NSW"]
[2852,62,"NSW"]
[2864,56,"NSW"]
[2865,56,"NSW"]
[2866,62,"NSW"]
[2867,62,"NSW"]
[2868,56,"NSW"]
[2869,56,"NSW"]
[2870,56,"NSW"]
[2871,56,"NSW"]
[2873,56,"NSW"]
[2874,56,"NSW"]
[2875,56,"NSW"]
[2876,56,"NSW"]
[2877,56,"NSW"]
[2878,52,"NSW"]
[2879,53,"NSW"]
[2880,53,"NSW"]
[2890,63,"NSW"]
[2891,63,"NSW"]
[2898,63,"NSW"]
[2899,63,"NSW"]
[2900,64,"NSW"]
[2901,64,"NSW"]
[2902,64,"NSW"]
[2903,64,"NSW"]
[2904,64,"NSW"]
[2905,64,"NSW"]
[2906,64,"NSW"]
[2911,64,"NSW"]
[2912,64,{"$f":"IF(OR(A1474<=299,AND(A1474<3000,A1474>=1000)),\"NSW\",IF(AND(A1474<=999,A1474>=800),\"NT\",IF(OR(AND(A1474<=8999,A1474>=8000),AND(A1474<=3999,A1474>=3000)),\"VIC\",IF(OR(AND(A1474<=9999,A1474>=9000),AND(A1474<=4999,A1474>=4000)),\"QLD\",IF(AND(A1474<=5999,A1474>=5000),\"SA\",IF(AND(A1474<=6999,A1474>=6000),\"WA\",\"TAS\"))))))","v":"NSW"}]
[2913,64,"NSW"]
[2914,64,"NSW"]
[3000,18,"VIC"]
[3001,18,"VIC"]
[3002,18,"VIC"]
[3003,18,"VIC"]
[3004,18,"VIC"]
[3005,18,"VIC"]
[3006,18,"VIC"]
[3008,18,"VIC"]
[3010,18,"VIC"]
[3011,18,"VIC"]
[3012,18,"VIC"]
[3013,18,"VIC"]
[3015,18,"VIC"]
[3016,18,"VIC"]
[3018,18,"VIC"]
[3019,18,"VIC"]
[3020,18,"VIC"]
[3021,18,"VIC"]
[3022,18,"VIC"]
[3023,18,"VIC"]
[3024,18,"VIC"]
[3025,18,"VIC"]
[3026,18,"VIC"]
[3028,18,"VIC"]
[3029,18,"VIC"]
[3030,18,"VIC"]
[3031,18,"VIC"]
[3032,18,"VIC"]
[3033,18,"VIC"]
[3034,18,"VIC"]
[3036,18,"VIC"]
[3037,18,"VIC"]
[3038,18,"VIC"]
[3039,18,"VIC"]
[3040,18,"VIC"]
[3041,18,"VIC"]
[3042,18,"VIC"]
[3043,18,"VIC"]
[3044,18,"VIC"]
[3045,18,"VIC"]
[3046,18,"VIC"]
[3047,18,"VIC"]
[3048,18,"VIC"]
[3049,18,"VIC"]
[3050,18,"VIC"]
[3051,18,"VIC"]
[3052,18,"VIC"]
[3053,18,"VIC"]
[3054,18,"VIC"]
[3055,18,"VIC"]
[3056,18,"VIC"]
[3057,18,"VIC"]
[3058,18,"VIC"]
[3059,18,"VIC"]
[3060,18,"VIC"]
[3061,18,"VIC"]
[3062,18,"VIC"]
[3063,18,"VIC"]
[3064,18,"VIC"]
[3065,18,"VIC"]
[3066,18,"VIC"]
[3067,18,{"$f":"IF(OR(A1538<=299,AND(A1538<3000,A1538>=1000)),\"NSW\",IF(AND(A1538<=999,A1538>=800),\"NT\",IF(OR(AND(A1538<=8999,A1538>=8000),AND(A1538<=3999,A1538>=3000)),\"VIC\",IF(OR(AND(A1538<=9999,A1538>=9000),AND(A1538<=4999,A1538>=4000)),\"QLD\",IF(AND(A1538<=5999,A1538>=5000),\"SA\",IF(AND(A1538<=6999,A1538>=6000),\"WA\",\"TAS\"))))))","v":"VIC"}]
[3068,18,"VIC"]
[3070,18,"VIC"]
[3071,18,"VIC"]
[3072,18,"VIC"]
[3073,18,"VIC"]
[3074,18,"VIC"]
[3075,18,"VIC"]
[3076,18,"VIC"]
[3078,18,"VIC"]
[3079,18,"VIC"]
[3081,18,"VIC"]
[3082,18,"VIC"]
[3083,18,"VIC"]
[3084,18,"VIC"]
[3085,18,"VIC"]
[3086,18,"VIC"]
[3087,18,"VIC"]
[3088,18,"VIC"]
[3089,18,"VIC"]
[3090,18,"VIC"]
[3091,18,"VIC"]
[3093,18,"VIC"]
[3094,18,"VIC"]
[3095,18,"VIC"]
[3096,18,"VIC"]
[3097,18,"VIC"]
[3099,18,"VIC"]
[3101,18,"VIC"]
[3102,18,"VIC"]
[3103,18,"VIC"]
[3104,18,"VIC"]
[3105,18,"VIC"]
[3106,18,"VIC"]
[3107,18,"VIC"]
[3108,18,"VIC"]
[3109,18,"VIC"]
[3110,18,"VIC"]
[3111,18,"VIC"]
[3113,18,"VIC"]
[3114,18,"VIC"]
[3115,18,"VIC"]
[3116,18,"VIC"]
[3121,18,"VIC"]
[3122,18,"VIC"]
[3123,18,"VIC"]
[3124,18,"VIC"]
[3125,18,"VIC"]
[3126,18,"VIC"]
[3127,18,"VIC"]
[3128,18,"VIC"]
[3129,18,"VIC"]
[3130,18,"VIC"]
[3131,18,"VIC"]
[3132,18,"VIC"]
[3133,18,"VIC"]
[3134,18,"VIC"]
[3135,18,"VIC"]
[3136,18,"VIC"]
[3137,18,"VIC"]
[3138,18,"VIC"]
[3139,18,"VIC"]
[3140,18,"VIC"]
[3141,18,"VIC"]
[3142,18,{"$f":"IF(OR(A1602<=299,AND(A1602<3000,A1602>=1000)),\"NSW\",IF(AND(A1602<=999,A1602>=800),\"NT\",IF(OR(AND(A1602<=8999,A1602>=8000),AND(A1602<=3999,A1602>=3000)),\"VIC\",IF(OR(AND(A1602<=9999,A1602>=9000),AND(A1602<=4999,A1602>=4000)),\"QLD\",IF(AND(A1602<=5999,A1602>=5000),\"SA\",IF(AND(A1602<=6999,A1602>=6000),\"WA\",\"TAS\"))))))","v":"VIC"}]
[3143,18,"VIC"]
[3144,18,"VIC"]
[3145,18,"VIC"]
[3146,18,"VIC"]
[3147,18,"VIC"]
[3148,18,"VIC"]
[3149,18,"VIC"]
[3150,18,"VIC"]
[3151,18,"VIC"]
[3152,18,"VIC"]
[3153,18,"VIC"]
[3154,18,"VIC"]
[3155,18,"VIC"]
[3156,18,"VIC"]
[3158,18,"VIC"]
[3159,18,"VIC"]
[3160,18,"VIC"]
[3161,18,"VIC"]
[3162,18,"VIC"]
[3163,18,"VIC"]
[3164,18,"VIC"]
[3165,18,"VIC"]
[3166,18,"VIC"]
[3167,18,"VIC"]
[3168,18,"VIC"]
[3169,18,"VIC"]
[3170,18,"VIC"]
[3171,18,"VIC"]
[3172,18,"VIC"]
[3173,18,"VIC"]
[3174,18,"VIC"]
[3175,18,"VIC"]
[3176,18,"VIC"]
[3177,18,"VIC"]
[3178,18,"VIC"]
[3179,18,"VIC"]
[3180,18,"VIC"]
[3181,18,"VIC"]
[3182,18,"VIC"]
[3183,18,"VIC"]
[3184,18,"VIC"]
[3185,18,"VIC"]
[3186,18,"VIC"]
[3187,18,"VIC"]
[3188,18,"VIC"]
[3189,18,"VIC"]
[3190,18,"VIC"]
[3191,18,"VIC"]
[3192,18,"VIC"]
[3193,18,"VIC"]
[3194,18,"VIC"]
[3195,18,"VIC"]
[3196,18,"VIC"]
[3197,18,"VIC"]
[3198,18,"VIC"]
[3199,18,"VIC"]
[3200,18,"VIC"]
[3201,18,"VIC"]
[3202,18,"VIC"]
[3204,18,"VIC"]
[3205,18,"VIC"]
[3206,18,"VIC"]
[3207,18,"VIC"]
[3211,18,{"$f":"IF(OR(A1666<=299,AND(A1666<3000,A1666>=1000)),\"NSW\",IF(AND(A1666<=999,A1666>=800),\"NT\",IF(OR(AND(A1666<=8999,A1666>=8000),AND(A1666<=3999,A1666>=3000)),\"VIC\",IF(OR(AND(A1666<=9999,A1666>=9000),AND(A1666<=4999,A1666>=4000)),\"QLD\",IF(AND(A1666<=5999,A1666>=5000),\"SA\",IF(AND(A1666<=6999,A1666>=6000),\"WA\",\"TAS\"))))))","v":"VIC"}]
[3212,18,"VIC"]
[3214,18,"VIC"]
[3215,18,"VIC"]
[3216,18,"VIC"]
[3217,18,"VIC"]
[3218,18,"VIC"]
[3219,18,"VIC"]
[3220,18,"VIC"]
[3221,18,"VIC"]
[3222,18,"VIC"]
[3223,18,"VIC"]
[3224,18,"VIC"]
[3225,18,"VIC"]
[3226,18,"VIC"]
[3227,18,"VIC"]
[3228,18,"VIC"]
[3230,18,"VIC"]
[3231,18,"VIC"]
[3232,15,"VIC"]
[3233,15,"VIC"]
[3235,15,"VIC"]
[3236,15,"VIC"]
[3237,15,"VIC"]
[3238,15,"VIC"]
[3239,15,"VIC"]
[3240,18,"VIC"]
[3241,18,"VIC"]
[3242,15,"VIC"]
[3243,15,"VIC"]
[3249,15,"VIC"]
[3250,15,"VIC"]
[3251,15,"VIC"]
[3254,15,"VIC"]
[3260,15,"VIC"]
[3264,15,"VIC"]
[3265,15,"VIC"]
[3266,15,"VIC"]
[3267,15,"VIC"]
[3268,15,"VIC"]
[3269,15,"VIC"]
[3270,15,"VIC"]
[3271,15,"VIC"]
[3272,15,"VIC"]
[3273,15,"VIC"]
[3274,15,"VIC"]
[3275,15,"VIC"]
[3276,15,"VIC"]
[3277,15,"VIC"]
[3278,15,"VIC"]
[3279,15,"VIC"]
[3280,15,"VIC"]
[3281,15,"VIC"]
[3282,15,"VIC"]
[3283,15,"VIC"]
[3284,15,"VIC"]
[3285,15,"VIC"]
[3286,15,"VIC"]
[3287,15,"VIC"]
[3289,15,"VIC"]
[3292,15,"VIC"]
[3293,15,"VIC"]
[3294,15,"VIC"]
[3300,15,"VIC"]
[3301,15,{"$f":"IF(OR(A1730<=299,AND(A1730<3000,A1730>=1000)),\"NSW\",IF(AND(A1730<=999,A1730>=800),\"NT\",IF(OR(AND(A1730<=8999,A1730>=8000),AND(A1730<=3999,A1730>=3000)),\"VIC\",IF(OR(AND(A1730<=9999,A1730>=9000),AND(A1730<=4999,A1730>=4000)),\"QLD\",IF(AND(A1730<=5999,A1730>=5000),\"SA\",IF(AND(A1730<=6999,A1730>=6000),\"WA\",\"TAS\"))))))","v":"VIC"}]
[3302,15,"VIC"]
[3303,15,"VIC"]
[3304,15,"VIC"]
[3305,15,"VIC"]
[3309,15,"VIC"]
[3310,15,"VIC"]
[3311,15,"VIC"]
[3312,15,"VIC"]
[3314,15,"VIC"]
[3315,15,"VIC"]
[3317,14,"VIC"]
[3318,14,"VIC"]
[3319,14,"VIC"]
[3321,18,"VIC"]
[3322,15,"VIC"]
[3323,18,"VIC"]
[3324,15,"VIC"]
[3325,15,"VIC"]
[3328,18,"VIC"]
[3329,18,"VIC"]
[3330,18,"VIC"]
[3331,18,"VIC"]
[3332,18,"VIC"]
[3333,18,"VIC"]
[3334,18,"VIC"]
[3335,18,"VIC"]
[3337,18,"VIC"]
[3338,18,"VIC"]
[3340,18,"VIC"]
[3341,18,"VIC"]
[3342,18,"VIC"]
[3345,18,"VIC"]
[3350,15,"VIC"]
[3351,15,"VIC"]
[3352,15,"VIC"]
[3353,15,"VIC"]
[3354,15,"VIC"]
[3355,15,"VIC"]
[3356,15,"VIC"]
[3357,15,"VIC"]
[3360,15,"VIC"]
[3361,15,"VIC"]
[3363,17,"VIC"]
[3364,17,"VIC"]
[3370,17,"VIC"]
[3371,17,"VIC"]
[3373,16,"VIC"]
[3375,14,"VIC"]
[3377,14,"VIC"]
[3378,14,"VIC"]
[3379,15,"VIC"]
[3380,14,"VIC"]
[3381,14,"VIC"]
[3384,14,"VIC"]
[3385,14,"VIC"]
[3387,14,"VIC"]
[3388,14,"VIC"]
[3390,14,"VIC"]
[3391,14,"VIC"]
[3392,14,"VIC"]
[3393,14,"VIC"]
[3395,13,"VIC"]
[3396,13,"VIC"]
[3399,14,{"$f":"IF(OR(A1794<=299,AND(A1794<3000,A1794>=1000)),\"NSW\",IF(AND(A1794<=999,A1794>=800),\"NT\",IF(OR(AND(A1794<=8999,A1794>=8000),AND(A1794<=3999,A1794>=3000)),\"VIC\",IF(OR(AND(A1794<=9999,A1794>=9000),AND(A1794<=4999,A1794>=4000)),\"QLD\",IF(AND(A1794<=5999,A1794>=5000),\"SA\",IF(AND(A1794<=6999,A1794>=6000),\"WA\",\"TAS\"))))))","v":"VIC"}]
[3400,14,"VIC"]
[3401,14,"VIC"]
[3402,14,"VIC"]
[3407,15,"VIC"]
[3409,14,"VIC"]
[3412,14,"VIC"]
[3413,14,"VIC"]
[3414,14,"VIC"]
[3415,14,"VIC"]
[3418,14,"VIC"]
[3419,14,"VIC"]
[3420,14,"VIC"]
[3422,13,"VIC"]
[3423,14,"VIC"]
[3424,13,"VIC"]
[3427,18,"VIC"]
[3428,18,"VIC"]
[3429,18,"VIC"]
[3430,18,"VIC"]
[3431,17,"VIC"]
[3432,17,"VIC"]
[3433,17,"VIC"]
[3434,17,"VIC"]
[3435,17,"VIC"]
[3437,17,"VIC"]
[3438,17,"VIC"]
[3440,17,"VIC"]
[3441,17,"VIC"]
[3442,17,"VIC"]
[3444,17,"VIC"]
[3446,17,"VIC"]
[3447,17,"VIC"]
[3448,17,"VIC"]
[3450,17,"VIC"]
[3451,17,"VIC"]
[3453,17,"VIC"]
[3458,17,"VIC"]
[3460,17,"VIC"]
[3461,17,"VIC"]
[3462,17,"VIC"]
[3463,17,"VIC"]
[3464,17,"VIC"]
[3465,17,"VIC"]
[3467,17,"VIC"]
[3468,16,"VIC"]
[3469,14,"VIC"]
[3472,16,"VIC"]
[3475,16,"VIC"]
[3478,14,"VIC"]
[3480,14,"VIC"]
[3482,14,"VIC"]
[3483,13,"VIC"]
[3485,13,"VIC"]
[3487,13,"VIC"]
[3488,13,"VIC"]
[3489,13,"VIC"]
[3490,13,"VIC"]
[3491,13,"VIC"]
[3494,13,"VIC"]
[3496,13,"VIC"]
[3498,13,"VIC"]
[3500,13,"VIC"]
[3501,13,"VIC"]
[3502,13,{"$f":"IF(OR(A1858<=299,AND(A1858<3000,A1858>=1000)),\"NSW\",IF(AND(A1858<=999,A1858>=800),\"NT\",IF(OR(AND(A1858<=8999,A1858>=8000),AND(A1858<=3999,A1858>=3000)),\"VIC\",IF(OR(AND(A1858<=9999,A1858>=9000),AND(A1858<=4999,A1858>=4000)),\"QLD\",IF(AND(A1858<=5999,A1858>=5000),\"SA\",IF(AND(A1858<=6999,A1858>=6000),\"WA\",\"TAS\"))))))","v":"VIC"}]
[3505,13,"VIC"]
[3506,13,"VIC"]
[3507,13,"VIC"]
[3509,13,"VIC"]
[3512,13,"VIC"]
[3515,16,"VIC"]
[3516,16,"VIC"]
[3517,16,"VIC"]
[3518,16,"VIC"]
[3520,16,"VIC"]
[3521,17,"VIC"]
[3522,17,"VIC"]
[3523,17,"VIC"]
[3525,17,"VIC"]
[3527,14,"VIC"]
[3529,13,"VIC"]
[3530,13,"VIC"]
[3531,13,"VIC"]
[3533,13,"VIC"]
[3537,13,"VIC"]
[3540,13,"VIC"]
[3542,13,"VIC"]
[3544,13,"VIC"]
[3546,13,"VIC"]
[3549,13,"VIC"]
[3550,16,"VIC"]
[3551,16,"VIC"]
[3552,16,"VIC"]
[3554,16,"VIC"]
[3555,16,"VIC"]
[3556,16,"VIC"]
[3557,16,"VIC"]
[3558,16,"VIC"]
[3559,16,"VIC"]
[3561,16,"VIC"]
[3562,16,"VIC"]
[3563,16,"VIC"]
[3564,16,"VIC"]
[3565,16,"VIC"]
[3566,16,"VIC"]
[3567,16,"VIC"]
[3568,16,"VIC"]
[3570,16,"VIC"]
[3571,16,"VIC"]
[3572,16,"VIC"]
[3573,16,"VIC"]
[3575,16,"VIC"]
[3576,16,"VIC"]
[3578,16,"VIC"]
[3579,16,"VIC"]
[3580,16,"VIC"]
[3581,13,"VIC"]
[3583,13,"VIC"]
[3584,13,"VIC"]
[3585,13,"VIC"]
[3586,13,"VIC"]
[3588,13,"VIC"]
[3589,13,"VIC"]
[3590,13,"VIC"]
[3591,13,"VIC"]
[3594,13,"VIC"]
[3595,13,"VIC"]
[3596,16,"VIC"]
[3597,13,{"$f":"IF(OR(A1922<=299,AND(A1922<3000,A1922>=1000)),\"NSW\",IF(AND(A1922<=999,A1922>=800),\"NT\",IF(OR(AND(A1922<=8999,A1922>=8000),AND(A1922<=3999,A1922>=3000)),\"VIC\",IF(OR(AND(A1922<=9999,A1922>=9000),AND(A1922<=4999,A1922>=4000)),\"QLD\",IF(AND(A1922<=5999,A1922>=5000),\"SA\",IF(AND(A1922<=6999,A1922>=6000),\"WA\",\"TAS\"))))))","v":"VIC"}]
[3599,13,"VIC"]
[3607,17,"VIC"]
[3608,16,"VIC"]
[3610,16,"VIC"]
[3612,16,"VIC"]
[3614,16,"VIC"]
[3616,16,"VIC"]
[3617,16,"VIC"]
[3618,16,"VIC"]
[3619,16,"VIC"]
[3620,16,"VIC"]
[3621,16,"VIC"]
[3622,16,"VIC"]
[3623,16,"VIC"]
[3624,16,"VIC"]
[3629,16,"VIC"]
[3630,16,"VIC"]
[3631,16,"VIC"]
[3632,16,"VIC"]
[3633,16,"VIC"]
[3634,16,"VIC"]
[3635,16,"VIC"]
[3636,16,"VIC"]
[3637,16,"VIC"]
[3638,16,"VIC"]
[3639,16,"VIC"]
[3640,16,"VIC"]
[3641,16,"VIC"]
[3643,16,"VIC"]
[3644,16,"VIC"]
[3646,16,"VIC"]
[3647,16,"VIC"]
[3649,16,"VIC"]
[3658,17,"VIC"]
[3659,17,"VIC"]
[3660,17,"VIC"]
[3661,17,"VIC"]
[3662,17,"VIC"]
[3663,17,"VIC"]
[3664,17,"VIC"]
[3665,16,"VIC"]
[3666,16,"VIC"]
[3669,16,"VIC"]
[3670,19,"VIC"]
[3671,19,"VIC"]
[3672,19,"VIC"]
[3673,19,"VIC"]
[3675,19,"VIC"]
[3676,19,"VIC"]
[3677,19,"VIC"]
[3678,19,"VIC"]
[3682,19,"VIC"]
[3683,19,"VIC"]
[3685,19,"VIC"]
[3687,19,"VIC"]
[3688,19,"VIC"]
[3689,19,"VIC"]
[3690,19,"VIC"]
[3691,19,"VIC"]
[3693,19,"VIC"]
[3694,19,"VIC"]
[3695,19,"VIC"]
[3697,19,"VIC"]
[3698,19,{"$f":"IF(OR(A1986<=299,AND(A1986<3000,A1986>=1000)),\"NSW\",IF(AND(A1986<=999,A1986>=800),\"NT\",IF(OR(AND(A1986<=8999,A1986>=8000),AND(A1986<=3999,A1986>=3000)),\"VIC\",IF(OR(AND(A1986<=9999,A1986>=9000),AND(A1986<=4999,A1986>=4000)),\"QLD\",IF(AND(A1986<=5999,A1986>=5000),\"SA\",IF(AND(A1986<=6999,A1986>=6000),\"WA\",\"TAS\"))))))","v":"VIC"}]
[3699,19,"VIC"]
[3700,19,"VIC"]
[3701,19,"VIC"]
[3704,19,"VIC"]
[3705,19,"VIC"]
[3707,19,"VIC"]
[3708,19,"VIC"]
[3709,19,"VIC"]
[3711,17,"VIC"]
[3712,17,"VIC"]
[3713,17,"VIC"]
[3714,17,"VIC"]
[3715,17,"VIC"]
[3717,17,"VIC"]
[3718,17,"VIC"]
[3719,17,"VIC"]
[3720,17,"VIC"]
[3722,19,"VIC"]
[3723,19,"VIC"]
[3724,19,"VIC"]
[3725,16,"VIC"]
[3726,16,"VIC"]
[3727,16,"VIC"]
[3728,16,"VIC"]
[3730,16,"VIC"]
[3732,19,"VIC"]
[3733,19,"VIC"]
[3735,19,"VIC"]
[3736,19,"VIC"]
[3737,19,"VIC"]
[3738,19,"VIC"]
[3739,19,"VIC"]
[3740,19,"VIC"]
[3741,19,"VIC"]
[3744,19,"VIC"]
[3746,19,"VIC"]
[3747,19,"VIC"]
[3749,19,"VIC"]
[3750,18,"VIC"]
[3751,17,"VIC"]
[3752,18,"VIC"]
[3753,17,"VIC"]
[3754,18,"VIC"]
[3755,18,"VIC"]
[3756,17,"VIC"]
[3757,17,"VIC"]
[3758,17,"VIC"]
[3759,18,"VIC"]
[3760,18,"VIC"]
[3761,18,"VIC"]
[3762,18,"VIC"]
[3763,18,"VIC"]
[3764,17,"VIC"]
[3765,18,"VIC"]
[3766,18,"VIC"]
[3767,18,"VIC"]
[3770,18,"VIC"]
[3775,18,"VIC"]
[3777,18,"VIC"]
[3778,18,"VIC"]
[3779,18,"VIC"]
[3781,18,"VIC"]
[3782,18,"VIC"]
[3783,18,{"$f":"IF(OR(A2050<=299,AND(A2050<3000,A2050>=1000)),\"NSW\",IF(AND(A2050<=999,A2050>=800),\"NT\",IF(OR(AND(A2050<=8999,A2050>=8000),AND(A2050<=3999,A2050>=3000)),\"VIC\",IF(OR(AND(A2050<=9999,A2050>=9000),AND(A2050<=4999,A2050>=4000)),\"QLD\",IF(AND(A2050<=5999,A2050>=5000),\"SA\",IF(AND(A2050<=6999,A2050>=6000),\"WA\",\"TAS\"))))))","v":"VIC"}]
[3785,18,"VIC"]
[3786,18,"VIC"]
[3787,18,"VIC"]
[3788,18,"VIC"]
[3789,18,"VIC"]
[3791,18,"VIC"]
[3792,18,"VIC"]
[3793,18,"VIC"]
[3795,18,"VIC"]
[3796,18,"VIC"]
[3797,18,"VIC"]
[3799,18,"VIC"]
[3800,18,"VIC"]
[3802,18,"VIC"]
[3803,18,"VIC"]
[3804,18,"VIC"]
[3805,18,"VIC"]
[3806,18,"VIC"]
[3807,18,"VIC"]
[3808,18,"VIC"]
[3809,18,"VIC"]
[3810,18,"VIC"]
[3812,18,"VIC"]
[3813,18,"VIC"]
[3814,18,"VIC"]
[3815,18,"VIC"]
[3816,18,"VIC"]
[3818,18,"VIC"]
[3820,20,"VIC"]
[3821,20,"VIC"]
[3822,20,"VIC"]
[3823,20,"VIC"]
[3824,20,"VIC"]
[3825,20,"VIC"]
[3831,20,"VIC"]
[3833,20,"VIC"]
[3835,20,"VIC"]
[3840,20,"VIC"]
[3841,20,"VIC"]
[3842,20,"VIC"]
[3844,20,"VIC"]
[3847,20,"VIC"]
[3850,20,"VIC"]
[3851,20,"VIC"]
[3852,20,"VIC"]
[3853,20,"VIC"]
[3854,20,"VIC"]
[3856,20,"VIC"]
[3857,20,"VIC"]
[3858,20,"VIC"]
[3859,20,"VIC"]
[3860,20,"VIC"]
[3862,21,"VIC"]
[3864,20,"VIC"]
[3865,21,"VIC"]
[3869,20,"VIC"]
[3870,20,"VIC"]
[3871,20,"VIC"]
[3873,20,"VIC"]
[3874,20,"VIC"]
[3875,21,"VIC"]
[3878,21,"VIC"]
[3880,21,"VIC"]
[3882,21,{"$f":"IF(OR(A2114<=299,AND(A2114<3000,A2114>=1000)),\"NSW\",IF(AND(A2114<=999,A2114>=800),\"NT\",IF(OR(AND(A2114<=8999,A2114>=8000),AND(A2114<=3999,A2114>=3000)),\"VIC\",IF(OR(AND(A2114<=9999,A2114>=9000),AND(A2114<=4999,A2114>=4000)),\"QLD\",IF(AND(A2114<=5999,A2114>=5000),\"SA\",IF(AND(A2114<=6999,A2114>=6000),\"WA\",\"TAS\"))))))","v":"VIC"}]
[3885,21,"VIC"]
[3886,21,"VIC"]
[3887,21,"VIC"]
[3888,21,"VIC"]
[3889,21,"VIC"]
[3890,21,"VIC"]
[3891,21,"VIC"]
[3892,21,"VIC"]
[3893,21,"VIC"]
[3895,21,"VIC"]
[3896,21,"VIC"]
[3898,19,"VIC"]
[3900,19,"VIC"]
[3902,21,"VIC"]
[3903,21,"VIC"]
[3904,21,"VIC"]
[3909,21,"VIC"]
[3910,18,"VIC"]
[3911,18,"VIC"]
[3912,18,"VIC"]
[3913,18,"VIC"]
[3915,18,"VIC"]
[3916,18,"VIC"]
[3918,18,"VIC"]
[3919,18,"VIC"]
[3920,18,"VIC"]
[3921,18,"VIC"]
[3922,18,"VIC"]
[3923,18,"VIC"]
[3925,18,"VIC"]
[3926,18,"VIC"]
[3927,18,"VIC"]
[3928,18,"VIC"]
[3929,18,"VIC"]
[3930,18,"VIC"]
[3931,18,"VIC"]
[3933,18,"VIC"]
[3934,18,"VIC"]
[3936,18,"VIC"]
[3937,18,"VIC"]
[3938,18,"VIC"]
[3939,18,"VIC"]
[3940,18,"VIC"]
[3941,18,"VIC"]
[3942,18,"VIC"]
[3943,18,"VIC"]
[3944,18,"VIC"]
[3945,18,"VIC"]
[3946,18,"VIC"]
[3950,18,"VIC"]
[3951,18,"VIC"]
[3953,20,"VIC"]
[3954,20,"VIC"]
[3956,20,"VIC"]
[3957,20,"VIC"]
[3958,20,"VIC"]
[3959,20,"VIC"]
[3960,20,"VIC"]
[3962,20,"VIC"]
[3964,20,"VIC"]
[3965,20,"VIC"]
[3966,20,"VIC"]
[3967,20,"VIC"]
[3971,20,{"$f":"IF(OR(A2178<=299,AND(A2178<3000,A2178>=1000)),\"NSW\",IF(AND(A2178<=999,A2178>=800),\"NT\",IF(OR(AND(A2178<=8999,A2178>=8000),AND(A2178<=3999,A2178>=3000)),\"VIC\",IF(OR(AND(A2178<=9999,A2178>=9000),AND(A2178<=4999,A2178>=4000)),\"QLD\",IF(AND(A2178<=5999,A2178>=5000),\"SA\",IF(AND(A2178<=6999,A2178>=6000),\"WA\",\"TAS\"))))))","v":"VIC"}]
[3975,18,"VIC"]
[3976,18,"VIC"]
[3977,18,"VIC"]
[3978,18,"VIC"]
[3979,18,"VIC"]
[3980,18,"VIC"]
[3981,18,"VIC"]
[3984,18,"VIC"]
[3987,18,"VIC"]
[3988,18,"VIC"]
[3989,18,"VIC"]
[3990,18,"VIC"]
[3991,18,"VIC"]
[3992,18,"VIC"]
[3995,18,"VIC"]
[3996,18,"VIC"]
[4000,51,"QLD"]
[4001,51,"QLD"]
[4002,51,"QLD"]
[4003,51,"QLD"]
[4004,51,"QLD"]
[4005,51,"QLD"]
[4006,51,"QLD"]
[4007,51,"QLD"]
[4008,51,"QLD"]
[4009,51,"QLD"]
[4010,51,"QLD"]
[4011,51,"QLD"]
[4012,51,"QLD"]
[4013,51,"QLD"]
[4014,51,"QLD"]
[4017,51,"QLD"]
[4018,51,"QLD"]
[4019,51,"QLD"]
[4020,51,"QLD"]
[4021,51,"QLD"]
[4022,51,"QLD"]
[4025,51,"QLD"]
[4029,51,"QLD"]
[4030,51,"QLD"]
[4031,51,"QLD"]
[4032,51,"QLD"]
[4034,51,"QLD"]
[4035,51,"QLD"]
[4036,51,"QLD"]
[4037,51,"QLD"]
[4051,51,"QLD"]
[4052,51,"QLD"]
[4053,51,"QLD"]
[4054,51,"QLD"]
[4055,51,"QLD"]
[4059,51,"QLD"]
[4060,51,"QLD"]
[4061,51,"QLD"]
[4064,51,"QLD"]
[4065,51,"QLD"]
[4066,51,"QLD"]
[4067,51,"QLD"]
[4068,51,"QLD"]
[4069,51,"QLD"]
[4070,51,"QLD"]
[4072,51,"QLD"]
[4073,51,"QLD"]
[4074,51,{"$f":"IF(OR(A2242<=299,AND(A2242<3000,A2242>=1000)),\"NSW\",IF(AND(A2242<=999,A2242>=800),\"NT\",IF(OR(AND(A2242<=8999,A2242>=8000),AND(A2242<=3999,A2242>=3000)),\"VIC\",IF(OR(AND(A2242<=9999,A2242>=9000),AND(A2242<=4999,A2242>=4000)),\"QLD\",IF(AND(A2242<=5999,A2242>=5000),\"SA\",IF(AND(A2242<=6999,A2242>=6000),\"WA\",\"TAS\"))))))","v":"QLD"}]
[4075,51,"QLD"]
[4076,51,"QLD"]
[4077,51,"QLD"]
[4078,51,"QLD"]
[4101,51,"QLD"]
[4102,51,"QLD"]
[4103,51,"QLD"]
[4104,51,"QLD"]
[4105,51,"QLD"]
[4106,51,"QLD"]
[4107,51,"QLD"]
[4108,51,"QLD"]
[4109,51,"QLD"]
[4110,51,"QLD"]
[4111,51,"QLD"]
[4112,51,"QLD"]
[4113,51,"QLD"]
[4114,51,"QLD"]
[4115,51,"QLD"]
[4116,51,"QLD"]
[4117,51,"QLD"]
[4118,51,"QLD"]
[4119,51,"QLD"]
[4120,51,"QLD"]
[4121,51,"QLD"]
[4122,51,"QLD"]
[4123,51,"QLD"]
[4124,51,"QLD"]
[4125,51,"QLD"]
[4127,51,"QLD"]
[4128,51,"QLD"]
[4129,51,"QLD"]
[4130,51,"QLD"]
[4131,51,"QLD"]
[4132,51,"QLD"]
[4133,51,"QLD"]
[4151,51,"QLD"]
[4152,51,"QLD"]
[4153,51,"QLD"]
[4154,51,"QLD"]
[4155,51,"QLD"]
[4156,51,"QLD"]
[4157,51,"QLD"]
[4158,51,"QLD"]
[4159,51,"QLD"]
[4160,51,"QLD"]
[4161,51,"QLD"]
[4163,51,"QLD"]
[4164,51,"QLD"]
[4165,51,"QLD"]
[4169,51,"QLD"]
[4170,51,"QLD"]
[4171,51,"QLD"]
[4172,51,"QLD"]
[4173,51,"QLD"]
[4174,51,"QLD"]
[4178,51,"QLD"]
[4179,51,"QLD"]
[4183,51,"QLD"]
[4184,51,"QLD"]
[4205,51,"QLD"]
[4207,51,"QLD"]
[4208,51,"QLD"]
[4209,51,{"$f":"IF(OR(A2306<=299,AND(A2306<3000,A2306>=1000)),\"NSW\",IF(AND(A2306<=999,A2306>=800),\"NT\",IF(OR(AND(A2306<=8999,A2306>=8000),AND(A2306<=3999,A2306>=3000)),\"VIC\",IF(OR(AND(A2306<=9999,A2306>=9000),AND(A2306<=4999,A2306>=4000)),\"QLD\",IF(AND(A2306<=5999,A2306>=5000),\"SA\",IF(AND(A2306<=6999,A2306>=6000),\"WA\",\"TAS\"))))))","v":"QLD"}]
[4210,51,"QLD"]
[4211,51,"QLD"]
[4212,51,"QLD"]
[4213,51,"QLD"]
[4214,51,"QLD"]
[4215,51,"QLD"]
[4216,51,"QLD"]
[4217,51,"QLD"]
[4218,51,"QLD"]
[4219,51,"QLD"]
[4220,51,"QLD"]
[4221,51,"QLD"]
[4223,51,"QLD"]
[4224,51,"QLD"]
[4225,51,"QLD"]
[4226,51,"QLD"]
[4227,51,"QLD"]
[4228,51,"QLD"]
[4229,51,"QLD"]
[4230,51,"QLD"]
[4270,51,"QLD"]
[4271,51,"QLD"]
[4272,51,"QLD"]
[4275,51,"QLD"]
[4280,51,"QLD"]
[4285,51,"QLD"]
[4287,51,"QLD"]
[4300,51,"QLD"]
[4301,51,"QLD"]
[4303,51,"QLD"]
[4304,51,"QLD"]
[4305,51,"QLD"]
[4306,51,"QLD"]
[4307,51,"QLD"]
[4309,51,"QLD"]
[4310,51,"QLD"]
[4311,51,"QLD"]
[4312,51,"QLD"]
[4313,51,"QLD"]
[4340,51,"QLD"]
[4341,51,"QLD"]
[4342,51,"QLD"]
[4343,51,"QLD"]
[4344,51,"QLD"]
[4345,51,"QLD"]
[4346,51,"QLD"]
[4347,51,"QLD"]
[4350,49,"QLD"]
[4352,49,"QLD"]
[4354,49,"QLD"]
[4355,49,"QLD"]
[4356,49,"QLD"]
[4357,49,"QLD"]
[4358,49,"QLD"]
[4359,49,"QLD"]
[4360,49,"QLD"]
[4361,49,"QLD"]
[4362,49,"QLD"]
[4370,49,"QLD"]
[4371,49,"QLD"]
[4372,49,"QLD"]
[4373,49,"QLD"]
[4374,49,"QLD"]
[4375,49,{"$f":"IF(OR(A2370<=299,AND(A2370<3000,A2370>=1000)),\"NSW\",IF(AND(A2370<=999,A2370>=800),\"NT\",IF(OR(AND(A2370<=8999,A2370>=8000),AND(A2370<=3999,A2370>=3000)),\"VIC\",IF(OR(AND(A2370<=9999,A2370>=9000),AND(A2370<=4999,A2370>=4000)),\"QLD\",IF(AND(A2370<=5999,A2370>=5000),\"SA\",IF(AND(A2370<=6999,A2370>=6000),\"WA\",\"TAS\"))))))","v":"QLD"}]
[4376,49,"QLD"]
[4377,49,"QLD"]
[4378,49,"QLD"]
[4380,49,"QLD"]
[4381,49,"QLD"]
[4382,49,"QLD"]
[4383,49,"QLD"]
[4384,49,"QLD"]
[4385,49,"QLD"]
[4387,49,"QLD"]
[4388,49,"QLD"]
[4390,49,"QLD"]
[4400,49,"QLD"]
[4401,49,"QLD"]
[4402,49,"QLD"]
[4403,49,"QLD"]
[4404,49,"QLD"]
[4405,49,"QLD"]
[4406,49,"QLD"]
[4407,49,"QLD"]
[4408,49,"QLD"]
[4410,49,"QLD"]
[4411,49,"QLD"]
[4412,49,"QLD"]
[4413,49,"QLD"]
[4415,49,"QLD"]
[4416,49,"QLD"]
[4417,48,"QLD"]
[4418,44,"QLD"]
[4419,44,"QLD"]
[4420,44,"QLD"]
[4421,49,"QLD"]
[4422,48,"QLD"]
[4423,48,"QLD"]
[4424,48,"QLD"]
[4425,48,"QLD"]
[4426,48,"QLD"]
[4427,48,"QLD"]
[4428,48,"QLD"]
[4454,48,"QLD"]
[4455,48,"QLD"]
[4461,48,"QLD"]
[4462,48,"QLD"]
[4465,48,"QLD"]
[4467,48,"QLD"]
[4468,48,"QLD"]
[4470,48,"QLD"]
[4471,48,"QLD"]
[4472,45,"QLD"]
[4474,47,"QLD"]
[4475,48,"QLD"]
[4477,45,"QLD"]
[4478,45,"QLD"]
[4479,48,"QLD"]
[4480,47,"QLD"]
[4481,47,"QLD"]
[4482,47,"QLD"]
[4486,48,"QLD"]
[4487,48,"QLD"]
[4488,48,"QLD"]
[4489,48,"QLD"]
[4490,48,"QLD"]
[4491,48,"QLD"]
[4492,47,{"$f":"IF(OR(A2434<=299,AND(A2434<3000,A2434>=1000)),\"NSW\",IF(AND(A2434<=999,A2434>=800),\"NT\",IF(OR(AND(A2434<=8999,A2434>=8000),AND(A2434<=3999,A2434>=3000)),\"VIC\",IF(OR(AND(A2434<=9999,A2434>=9000),AND(A2434<=4999,A2434>=4000)),\"QLD\",IF(AND(A2434<=5999,A2434>=5000),\"SA\",IF(AND(A2434<=6999,A2434>=6000),\"WA\",\"TAS\"))))))","v":"QLD"}]
[4493,48,"QLD"]
[4494,49,"QLD"]
[4496,49,"QLD"]
[4497,49,"QLD"]
[4498,49,"QLD"]
[4500,51,"QLD"]
[4501,51,"QLD"]
[4502,51,"QLD"]
[4503,51,"QLD"]
[4504,51,"QLD"]
[4505,51,"QLD"]
[4506,51,"QLD"]
[4507,51,"QLD"]
[4508,51,"QLD"]
[4509,51,"QLD"]
[4510,51,"QLD"]
[4511,51,"QLD"]
[4512,51,"QLD"]
[4514,51,"QLD"]
[4515,51,"QLD"]
[4516,51,"QLD"]
[4517,51,"QLD"]
[4518,51,"QLD"]
[4519,51,"QLD"]
[4520,51,"QLD"]
[4521,51,"QLD"]
[4550,51,"QLD"]
[4551,51,"QLD"]
[4552,51,"QLD"]
[4553,51,"QLD"]
[4554,51,"QLD"]
[4555,51,"QLD"]
[4556,51,"QLD"]
[4557,51,"QLD"]
[4558,51,"QLD"]
[4559,51,"QLD"]
[4560,51,"QLD"]
[4561,51,"QLD"]
[4562,51,"QLD"]
[4563,51,"QLD"]
[4564,51,"QLD"]
[4565,51,"QLD"]
[4566,51,"QLD"]
[4567,51,"QLD"]
[4568,51,"QLD"]
[4569,51,"QLD"]
[4570,50,"QLD"]
[4571,51,"QLD"]
[4572,51,"QLD"]
[4573,51,"QLD"]
[4574,51,"QLD"]
[4575,51,"QLD"]
[4580,50,"QLD"]
[4581,50,"QLD"]
[4600,50,"QLD"]
[4601,50,"QLD"]
[4605,50,"QLD"]
[4606,50,"QLD"]
[4608,50,"QLD"]
[4610,50,"QLD"]
[4611,50,"QLD"]
[4612,50,"QLD"]
[4613,50,"QLD"]
[4614,50,{"$f":"IF(OR(A2498<=299,AND(A2498<3000,A2498>=1000)),\"NSW\",IF(AND(A2498<=999,A2498>=800),\"NT\",IF(OR(AND(A2498<=8999,A2498>=8000),AND(A2498<=3999,A2498>=3000)),\"VIC\",IF(OR(AND(A2498<=9999,A2498>=9000),AND(A2498<=4999,A2498>=4000)),\"QLD\",IF(AND(A2498<=5999,A2498>=5000),\"SA\",IF(AND(A2498<=6999,A2498>=6000),\"WA\",\"TAS\"))))))","v":"QLD"}]
[4615,50,"QLD"]
[4620,50,"QLD"]
[4621,50,"QLD"]
[4625,50,"QLD"]
[4626,50,"QLD"]
[4627,50,"QLD"]
[4630,50,"QLD"]
[4650,50,"QLD"]
[4655,50,"QLD"]
[4659,50,"QLD"]
[4660,50,"QLD"]
[4662,50,"QLD"]
[4670,50,"QLD"]
[4671,50,"QLD"]
[4673,50,"QLD"]
[4674,50,"QLD"]
[4676,50,"QLD"]
[4677,43,"QLD"]
[4678,43,"QLD"]
[4680,43,"QLD"]
[4694,43,"QLD"]
[4695,43,"QLD"]
[4697,43,"QLD"]
[4699,43,"QLD"]
[4700,43,"QLD"]
[4701,43,"QLD"]
[4702,43,"QLD"]
[4703,43,"QLD"]
[4704,43,"QLD"]
[4705,43,"QLD"]
[4706,43,"QLD"]
[4707,43,"QLD"]
[4709,43,"QLD"]
[4714,43,"QLD"]
[4715,43,"QLD"]
[4716,43,"QLD"]
[4717,44,"QLD"]
[4718,43,"QLD"]
[4719,43,"QLD"]
[4720,44,"QLD"]
[4721,44,"QLD"]
[4722,44,"QLD"]
[4724,45,"QLD"]
[4725,45,"QLD"]
[4726,45,"QLD"]
[4727,45,"QLD"]
[4730,45,"QLD"]
[4731,45,"QLD"]
[4732,45,"QLD"]
[4733,45,"QLD"]
[4735,45,"QLD"]
[4736,47,"QLD"]
[4737,42,"QLD"]
[4738,42,"QLD"]
[4739,42,"QLD"]
[4740,42,"QLD"]
[4741,42,"QLD"]
[4742,42,"QLD"]
[4743,42,"QLD"]
[4744,44,"QLD"]
[4745,44,"QLD"]
[4746,44,"QLD"]
[4750,44,"QLD"]
[4751,42,{"$f":"IF(OR(A2562<=299,AND(A2562<3000,A2562>=1000)),\"NSW\",IF(AND(A2562<=999,A2562>=800),\"NT\",IF(OR(AND(A2562<=8999,A2562>=8000),AND(A2562<=3999,A2562>=3000)),\"VIC\",IF(OR(AND(A2562<=9999,A2562>=9000),AND(A2562<=4999,A2562>=4000)),\"QLD\",IF(AND(A2562<=5999,A2562>=5000),\"SA\",IF(AND(A2562<=6999,A2562>=6000),\"WA\",\"TAS\"))))))","v":"QLD"}]
[4753,42,"QLD"]
[4754,42,"QLD"]
[4756,42,"QLD"]
[4757,42,"QLD"]
[4798,42,"QLD"]
[4799,42,"QLD"]
[4800,42,"QLD"]
[4801,42,"QLD"]
[4802,42,"QLD"]
[4803,42,"QLD"]
[4804,42,"QLD"]
[4805,42,"QLD"]
[4806,41,"QLD"]
[4807,41,"QLD"]
[4808,41,"QLD"]
[4809,41,"QLD"]
[4810,41,"QLD"]
[4811,41,"QLD"]
[4812,41,"QLD"]
[4813,41,"QLD"]
[4814,41,"QLD"]
[4815,41,"QLD"]
[4816,41,"QLD"]
[4817,41,"QLD"]
[4818,41,"QLD"]
[4819,41,"QLD"]
[4820,38,"QLD"]
[4821,38,"QLD"]
[4822,38,"QLD"]
[4823,46,"QLD"]
[4824,46,"QLD"]
[4825,46,"QLD"]
[4828,46,"QLD"]
[4829,47,"QLD"]
[4830,46,"QLD"]
[4849,39,"QLD"]
[4850,39,"QLD"]
[4852,39,"QLD"]
[4854,39,"QLD"]
[4855,39,"QLD"]
[4856,39,"QLD"]
[4857,39,"QLD"]
[4858,39,"QLD"]
[4859,39,"QLD"]
[4860,39,"QLD"]
[4861,39,"QLD"]
[4865,39,"QLD"]
[4868,39,"QLD"]
[4869,39,"QLD"]
[4870,39,"QLD"]
[4871,39,"QLD"]
[4872,39,"QLD"]
[4873,39,"QLD"]
[4874,36,"QLD"]
[4875,36,"QLD"]
[4876,36,"QLD"]
[4878,39,"QLD"]
[4879,39,"QLD"]
[4880,39,"QLD"]
[4882,39,"QLD"]
[4883,39,"QLD"]
[4885,39,"QLD"]
[4886,39,"QLD"]
[4890,39,{"$f":"IF(OR(A2626<=299,AND(A2626<3000,A2626>=1000)),\"NSW\",IF(AND(A2626<=999,A2626>=800),\"NT\",IF(OR(AND(A2626<=8999,A2626>=8000),AND(A2626<=3999,A2626>=3000)),\"VIC\",IF(OR(AND(A2626<=9999,A2626>=9000),AND(A2626<=4999,A2626>=4000)),\"QLD\",IF(AND(A2626<=5999,A2626>=5000),\"SA\",IF(AND(A2626<=6999,A2626>=6000),\"WA\",\"TAS\"))))))","v":"QLD"}]
[4891,39,"QLD"]
[5000,33,"SA"]
[5001,33,"SA"]
[5005,33,"SA"]
[5006,33,"SA"]
[5007,33,"SA"]
[5008,33,"SA"]
[5009,33,"SA"]
[5010,33,"SA"]
[5011,33,"SA"]
[5012,33,"SA"]
[5013,33,"SA"]
[5014,33,"SA"]
[5015,33,"SA"]
[5016,33,"SA"]
[5017,33,"SA"]
[5018,33,"SA"]
[5019,33,"SA"]
[5020,33,"SA"]
[5021,33,"SA"]
[5022,33,"SA"]
[5023,33,"SA"]
[5024,33,"SA"]
[5025,33,"SA"]
[5031,33,"SA"]
[5032,33,"SA"]
[5033,33,"SA"]
[5034,33,"SA"]
[5035,33,"SA"]
[5037,33,"SA"]
[5038,33,"SA"]
[5039,33,"SA"]
[5040,33,"SA"]
[5041,33,"SA"]
[5042,33,"SA"]
[5043,33,"SA"]
[5044,33,"SA"]
[5045,33,"SA"]
[5046,33,"SA"]
[5047,33,"SA"]
[5048,33,"SA"]
[5049,33,"SA"]
[5050,33,"SA"]
[5051,33,"SA"]
[5052,33,"SA"]
[5061,33,"SA"]
[5062,33,"SA"]
[5063,33,"SA"]
[5064,33,"SA"]
[5065,33,"SA"]
[5066,33,"SA"]
[5067,33,"SA"]
[5068,33,"SA"]
[5069,33,"SA"]
[5070,33,"SA"]
[5071,33,"SA"]
[5072,33,"SA"]
[5073,33,"SA"]
[5074,33,"SA"]
[5075,33,"SA"]
[5076,33,"SA"]
[5081,33,"SA"]
[5082,33,"SA"]
[5083,33,{"$f":"IF(OR(A2690<=299,AND(A2690<3000,A2690>=1000)),\"NSW\",IF(AND(A2690<=999,A2690>=800),\"NT\",IF(OR(AND(A2690<=8999,A2690>=8000),AND(A2690<=3999,A2690>=3000)),\"VIC\",IF(OR(AND(A2690<=9999,A2690>=9000),AND(A2690<=4999,A2690>=4000)),\"QLD\",IF(AND(A2690<=5999,A2690>=5000),\"SA\",IF(AND(A2690<=6999,A2690>=6000),\"WA\",\"TAS\"))))))","v":"SA"}]
[5084,33,"SA"]
[5085,33,"SA"]
[5086,33,"SA"]
[5087,33,"SA"]
[5088,33,"SA"]
[5089,33,"SA"]
[5090,33,"SA"]
[5091,33,"SA"]
[5092,33,"SA"]
[5093,33,"SA"]
[5094,33,"SA"]
[5095,33,"SA"]
[5096,33,"SA"]
[5097,33,"SA"]
[5098,33,"SA"]
[5106,33,"SA"]
[5107,33,"SA"]
[5108,33,"SA"]
[5109,33,"SA"]
[5110,33,"SA"]
[5111,33,"SA"]
[5112,33,"SA"]
[5113,33,"SA"]
[5114,33,"SA"]
[5115,33,"SA"]
[5116,33,"SA"]
[5117,33,"SA"]
[5118,33,"SA"]
[5120,33,"SA"]
[5121,33,"SA"]
[5125,33,"SA"]
[5126,33,"SA"]
[5127,33,"SA"]
[5131,33,"SA"]
[5132,33,"SA"]
[5133,33,"SA"]
[5134,33,"SA"]
[5136,33,"SA"]
[5137,33,"SA"]
[5138,33,"SA"]
[5139,33,"SA"]
[5140,33,"SA"]
[5141,33,"SA"]
[5142,33,"SA"]
[5144,33,"SA"]
[5150,33,"SA"]
[5151,33,"SA"]
[5152,33,"SA"]
[5153,33,"SA"]
[5154,33,"SA"]
[5155,33,"SA"]
[5156,33,"SA"]
[5157,33,"SA"]
[5158,33,"SA"]
[5159,33,"SA"]
[5160,33,"SA"]
[5161,33,"SA"]
[5162,33,"SA"]
[5163,33,"SA"]
[5164,33,"SA"]
[5165,33,"SA"]
[5166,33,"SA"]
[5167,33,"SA"]
[5168,33,{"$f":"IF(OR(A2754<=299,AND(A2754<3000,A2754>=1000)),\"NSW\",IF(AND(A2754<=999,A2754>=800),\"NT\",IF(OR(AND(A2754<=8999,A2754>=8000),AND(A2754<=3999,A2754>=3000)),\"VIC\",IF(OR(AND(A2754<=9999,A2754>=9000),AND(A2754<=4999,A2754>=4000)),\"QLD\",IF(AND(A2754<=5999,A2754>=5000),\"SA\",IF(AND(A2754<=6999,A2754>=6000),\"WA\",\"TAS\"))))))","v":"SA"}]
[5169,33,"SA"]
[5170,33,"SA"]
[5171,33,"SA"]
[5172,33,"SA"]
[5173,33,"SA"]
[5174,33,"SA"]
[5201,33,"SA"]
[5202,33,"SA"]
[5203,33,"SA"]
[5204,33,"SA"]
[5210,33,"SA"]
[5211,33,"SA"]
[5212,33,"SA"]
[5213,33,"SA"]
[5214,33,"SA"]
[5220,33,"SA"]
[5221,33,"SA"]
[5222,33,"SA"]
[5223,33,"SA"]
[5231,33,"SA"]
[5232,33,"SA"]
[5233,33,"SA"]
[5234,33,"SA"]
[5235,33,"SA"]
[5236,33,"SA"]
[5237,33,"SA"]
[5238,33,"SA"]
[5240,33,"SA"]
[5241,33,"SA"]
[5242,33,"SA"]
[5243,33,"SA"]
[5244,33,"SA"]
[5245,33,"SA"]
[5250,33,"SA"]
[5251,33,"SA"]
[5252,33,"SA"]
[5253,33,"SA"]
[5254,33,"SA"]
[5255,33,"SA"]
[5256,33,"SA"]
[5259,34,"SA"]
[5260,34,"SA"]
[5261,34,"SA"]
[5262,35,"SA"]
[5263,35,"SA"]
[5264,34,"SA"]
[5265,34,"SA"]
[5266,34,"SA"]
[5267,35,"SA"]
[5268,35,"SA"]
[5269,35,"SA"]
[5270,35,"SA"]
[5271,35,"SA"]
[5272,35,"SA"]
[5273,35,"SA"]
[5275,35,"SA"]
[5276,35,"SA"]
[5277,35,"SA"]
[5278,35,"SA"]
[5279,35,"SA"]
[5280,35,"SA"]
[5290,35,"SA"]
[5291,35,"SA"]
[5301,34,{"$f":"IF(OR(A2818<=299,AND(A2818<3000,A2818>=1000)),\"NSW\",IF(AND(A2818<=999,A2818>=800),\"NT\",IF(OR(AND(A2818<=8999,A2818>=8000),AND(A2818<=3999,A2818>=3000)),\"VIC\",IF(OR(AND(A2818<=9999,A2818>=9000),AND(A2818<=4999,A2818>=4000)),\"QLD\",IF(AND(A2818<=5999,A2818>=5000),\"SA\",IF(AND(A2818<=6999,A2818>=6000),\"WA\",\"TAS\"))))))","v":"SA"}]
[5302,34,"SA"]
[5303,33,"SA"]
[5304,34,"SA"]
[5306,34,"SA"]
[5307,34,"SA"]
[5308,34,"SA"]
[5309,34,"SA"]
[5310,34,"SA"]
[5311,34,"SA"]
[5312,34,"SA"]
[5320,34,"SA"]
[5321,34,"SA"]
[5322,34,"SA"]
[5330,34,"SA"]
[5331,34,"SA"]
[5332,34,"SA"]
[5333,34,"SA"]
[5340,34,"SA"]
[5341,34,"SA"]
[5342,34,"SA"]
[5343,34,"SA"]
[5344,34,"SA"]
[5345,34,"SA"]
[5346,34,"SA"]
[5350,33,"SA"]
[5351,33,"SA"]
[5352,33,"SA"]
[5353,33,"SA"]
[5354,34,"SA"]
[5355,33,"SA"]
[5356,34,"SA"]
[5357,34,"SA"]
[5360,33,"SA"]
[5371,33,"SA"]
[5372,33,"SA"]
[5373,32,"SA"]
[5374,32,"SA"]
[5381,32,"SA"]
[5400,32,"SA"]
[5401,32,"SA"]
[5410,32,"SA"]
[5411,32,"SA"]
[5412,32,"SA"]
[5413,32,"SA"]
[5414,32,"SA"]
[5415,32,"SA"]
[5416,32,"SA"]
[5417,32,"SA"]
[5418,32,"SA"]
[5419,32,"SA"]
[5420,32,"SA"]
[5421,32,"SA"]
[5422,32,"SA"]
[5430,32,"SA"]
[5431,32,"SA"]
[5432,32,"SA"]
[5433,32,"SA"]
[5434,32,"SA"]
[5440,32,"SA"]
[5451,32,"SA"]
[5452,32,"SA"]
[5453,32,"SA"]
[5454,32,"SA"]
[5455,32,{"$f":"IF(OR(A2882<=299,AND(A2882<3000,A2882>=1000)),\"NSW\",IF(AND(A2882<=999,A2882>=800),\"NT\",IF(OR(AND(A2882<=8999,A2882>=8000),AND(A2882<=3999,A2882>=3000)),\"VIC\",IF(OR(AND(A2882<=9999,A2882>=9000),AND(A2882<=4999,A2882>=4000)),\"QLD\",IF(AND(A2882<=5999,A2882>=5000),\"SA\",IF(AND(A2882<=6999,A2882>=6000),\"WA\",\"TAS\"))))))","v":"SA"}]
[5460,32,"SA"]
[5461,32,"SA"]
[5462,32,"SA"]
[5464,32,"SA"]
[5470,32,"SA"]
[5471,32,"SA"]
[5472,32,"SA"]
[5473,32,"SA"]
[5480,32,"SA"]
[5481,32,"SA"]
[5482,32,"SA"]
[5483,32,"SA"]
[5485,32,"SA"]
[5490,32,"SA"]
[5491,32,"SA"]
[5493,32,"SA"]
[5495,32,"SA"]
[5501,33,"SA"]
[5502,32,"SA"]
[5510,32,"SA"]
[5520,32,"SA"]
[5521,32,"SA"]
[5522,32,"SA"]
[5523,32,"SA"]
[5540,32,"SA"]
[5550,32,"SA"]
[5552,33,"SA"]
[5554,33,"SA"]
[5555,33,"SA"]
[5556,33,"SA"]
[5558,33,"SA"]
[5560,32,"SA"]
[5570,33,"SA"]
[5571,33,"SA"]
[5572,33,"SA"]
[5573,33,"SA"]
[5575,33,"SA"]
[5576,33,"SA"]
[5577,33,"SA"]
[5580,33,"SA"]
[5581,33,"SA"]
[5582,33,"SA"]
[5583,33,"SA"]
[5600,29,"SA"]
[5601,29,"SA"]
[5602,29,"SA"]
[5603,29,"SA"]
[5604,29,"SA"]
[5605,29,"SA"]
[5606,29,"SA"]
[5607,29,"SA"]
[5608,29,"SA"]
[5609,29,"SA"]
[5630,29,"SA"]
[5631,29,"SA"]
[5632,29,"SA"]
[5633,29,"SA"]
[5640,29,"SA"]
[5641,29,"SA"]
[5642,29,"SA"]
[5650,29,"SA"]
[5651,29,"SA"]
[5652,29,"SA"]
[5653,29,{"$f":"IF(OR(A2946<=299,AND(A2946<3000,A2946>=1000)),\"NSW\",IF(AND(A2946<=999,A2946>=800),\"NT\",IF(OR(AND(A2946<=8999,A2946>=8000),AND(A2946<=3999,A2946>=3000)),\"VIC\",IF(OR(AND(A2946<=9999,A2946>=9000),AND(A2946<=4999,A2946>=4000)),\"QLD\",IF(AND(A2946<=5999,A2946>=5000),\"SA\",IF(AND(A2946<=6999,A2946>=6000),\"WA\",\"TAS\"))))))","v":"SA"}]
[5654,29,"SA"]
[5655,29,"SA"]
[5660,29,"SA"]
[5661,29,"SA"]
[5670,29,"SA"]
[5671,29,"SA"]
[5680,29,"SA"]
[5690,29,"SA"]
[5700,32,"SA"]
[5710,32,"SA"]
[5720,30,"SA"]
[5722,30,"SA"]
[5723,30,"SA"]
[5724,30,"SA"]
[5725,30,"SA"]
[5730,31,"SA"]
[5731,31,"SA"]
[5732,31,"SA"]
[5733,31,"SA"]
[5734,31,"SA"]
[5800,33,"SA"]
[5810,33,"SA"]
[5839,33,"SA"]
[5880,33,"SA"]
[5881,33,"SA"]
[5882,33,"SA"]
[5883,33,"SA"]
[5884,33,"SA"]
[5885,33,"SA"]
[5886,33,"SA"]
[5887,33,"SA"]
[5888,33,"SA"]
[5889,33,"SA"]
[5942,33,"SA"]
[5950,33,"SA"]
[6000,7,"WA"]
[6001,7,"WA"]
[6003,7,"WA"]
[6004,7,"WA"]
[6005,7,"WA"]
[6006,7,"WA"]
[6007,7,"WA"]
[6008,7,"WA"]
[6009,7,"WA"]
[6010,7,"WA"]
[6011,7,"WA"]
[6012,7,"WA"]
[6014,7,"WA"]
[6015,7,"WA"]
[6016,7,"WA"]
[6017,7,"WA"]
[6018,7,"WA"]
[6019,7,"WA"]
[6020,7,"WA"]
[6021,7,"WA"]
[6022,7,"WA"]
[6023,7,"WA"]
[6024,7,"WA"]
[6025,7,"WA"]
[6026,7,"WA"]
[6027,7,"WA"]
[6028,7,"WA"]
[6029,7,"WA"]
[6030,7,{"$f":"IF(OR(A3010<=299,AND(A3010<3000,A3010>=1000)),\"NSW\",IF(AND(A3010<=999,A3010>=800),\"NT\",IF(OR(AND(A3010<=8999,A3010>=8000),AND(A3010<=3999,A3010>=3000)),\"VIC\",IF(OR(AND(A3010<=9999,A3010>=9000),AND(A3010<=4999,A3010>=4000)),\"QLD\",IF(AND(A3010<=5999,A3010>=5000),\"SA\",IF(AND(A3010<=6999,A3010>=6000),\"WA\",\"TAS\"))))))","v":"WA"}]
[6031,7,"WA"]
[6032,7,"WA"]
[6033,7,"WA"]
[6034,7,"WA"]
[6035,7,"WA"]
[6036,7,"WA"]
[6037,7,"WA"]
[6038,7,"WA"]
[6041,7,"WA"]
[6042,7,"WA"]
[6043,7,"WA"]
[6044,7,"WA"]
[6050,7,"WA"]
[6051,7,"WA"]
[6052,7,"WA"]
[6053,7,"WA"]
[6054,7,"WA"]
[6055,7,"WA"]
[6056,7,"WA"]
[6057,7,"WA"]
[6058,7,"WA"]
[6059,7,"WA"]
[6060,7,"WA"]
[6061,7,"WA"]
[6062,7,"WA"]
[6063,7,"WA"]
[6064,7,"WA"]
[6065,7,"WA"]
[6066,7,"WA"]
[6067,7,"WA"]
[6068,7,"WA"]
[6069,7,"WA"]
[6070,7,"WA"]
[6071,7,"WA"]
[6072,7,"WA"]
[6073,7,"WA"]
[6074,7,"WA"]
[6076,7,"WA"]
[6081,7,"WA"]
[6082,7,"WA"]
[6083,7,"WA"]
[6084,7,"WA"]
[6090,7,"WA"]
[6100,7,"WA"]
[6101,7,"WA"]
[6102,7,"WA"]
[6103,7,"WA"]
[6104,7,"WA"]
[6105,7,"WA"]
[6106,7,"WA"]
[6107,7,"WA"]
[6108,7,"WA"]
[6109,7,"WA"]
[6110,7,"WA"]
[6111,7,"WA"]
[6112,7,"WA"]
[6121,7,"WA"]
[6122,7,"WA"]
[6123,7,"WA"]
[6124,7,"WA"]
[6125,7,"WA"]
[6126,7,"WA"]
[6147,7,"WA"]
[6148,7,{"$f":"IF(OR(A3074<=299,AND(A3074<3000,A3074>=1000)),\"NSW\",IF(AND(A3074<=999,A3074>=800),\"NT\",IF(OR(AND(A3074<=8999,A3074>=8000),AND(A3074<=3999,A3074>=3000)),\"VIC\",IF(OR(AND(A3074<=9999,A3074>=9000),AND(A3074<=4999,A3074>=4000)),\"QLD\",IF(AND(A3074<=5999,A3074>=5000),\"SA\",IF(AND(A3074<=6999,A3074>=6000),\"WA\",\"TAS\"))))))","v":"WA"}]
[6149,7,"WA"]
[6150,7,"WA"]
[6151,7,"WA"]
[6152,7,"WA"]
[6153,7,"WA"]
[6154,7,"WA"]
[6155,7,"WA"]
[6156,7,"WA"]
[6157,7,"WA"]
[6158,7,"WA"]
[6159,7,"WA"]
[6160,7,"WA"]
[6161,7,"WA"]
[6162,7,"WA"]
[6163,7,"WA"]
[6164,7,"WA"]
[6165,7,"WA"]
[6166,7,"WA"]
[6167,7,"WA"]
[6168,7,"WA"]
[6169,7,"WA"]
[6170,7,"WA"]
[6171,7,"WA"]
[6172,7,"WA"]
[6173,7,"WA"]
[6174,7,"WA"]
[6175,7,"WA"]
[6176,7,"WA"]
[6207,7,"WA"]
[6208,7,"WA"]
[6210,7,"WA"]
[6213,7,"WA"]
[6214,7,"WA"]
[6215,7,"WA"]
[6218,7,"WA"]
[6220,7,"WA"]
[6221,7,"WA"]
[6223,7,"WA"]
[6224,7,"WA"]
[6225,7,"WA"]
[6226,9,"WA"]
[6227,9,"WA"]
[6228,9,"WA"]
[6229,9,"WA"]
[6230,9,"WA"]
[6231,9,"WA"]
[6232,9,"WA"]
[6233,9,"WA"]
[6236,9,"WA"]
[6237,9,"WA"]
[6239,9,"WA"]
[6240,9,"WA"]
[6243,9,"WA"]
[6244,9,"WA"]
[6251,9,"WA"]
[6252,9,"WA"]
[6253,9,"WA"]
[6254,9,"WA"]
[6255,9,"WA"]
[6256,9,"WA"]
[6258,9,"WA"]
[6260,9,"WA"]
[6262,9,"WA"]
[6271,9,{"$f":"IF(OR(A3138<=299,AND(A3138<3000,A3138>=1000)),\"NSW\",IF(AND(A3138<=999,A3138>=800),\"NT\",IF(OR(AND(A3138<=8999,A3138>=8000),AND(A3138<=3999,A3138>=3000)),\"VIC\",IF(OR(AND(A3138<=9999,A3138>=9000),AND(A3138<=4999,A3138>=4000)),\"QLD\",IF(AND(A3138<=5999,A3138>=5000),\"SA\",IF(AND(A3138<=6999,A3138>=6000),\"WA\",\"TAS\"))))))","v":"WA"}]
[6275,9,"WA"]
[6280,9,"WA"]
[6281,9,"WA"]
[6282,9,"WA"]
[6284,9,"WA"]
[6285,9,"WA"]
[6286,9,"WA"]
[6288,9,"WA"]
[6290,9,"WA"]
[6302,7,"WA"]
[6304,7,"WA"]
[6306,7,"WA"]
[6308,7,"WA"]
[6309,8,"WA"]
[6311,8,"WA"]
[6312,8,"WA"]
[6313,8,"WA"]
[6315,8,"WA"]
[6316,8,"WA"]
[6317,8,"WA"]
[6318,8,"WA"]
[6320,8,"WA"]
[6321,10,"WA"]
[6322,10,"WA"]
[6323,10,"WA"]
[6324,10,"WA"]
[6326,10,"WA"]
[6327,10,"WA"]
[6328,10,"WA"]
[6330,10,"WA"]
[6331,10,"WA"]
[6332,10,"WA"]
[6333,9,"WA"]
[6335,8,"WA"]
[6336,8,"WA"]
[6337,8,"WA"]
[6338,8,"WA"]
[6341,8,"WA"]
[6343,8,"WA"]
[6346,10,"WA"]
[6348,10,"WA"]
[6350,8,"WA"]
[6351,8,"WA"]
[6352,8,"WA"]
[6353,8,"WA"]
[6355,8,"WA"]
[6356,8,"WA"]
[6357,8,"WA"]
[6358,8,"WA"]
[6359,8,"WA"]
[6361,8,"WA"]
[6363,8,"WA"]
[6365,8,"WA"]
[6367,8,"WA"]
[6368,6,"WA"]
[6369,6,"WA"]
[6370,8,"WA"]
[6372,8,"WA"]
[6373,8,"WA"]
[6375,8,"WA"]
[6376,8,"WA"]
[6380,6,"WA"]
[6383,6,"WA"]
[6384,6,{"$f":"IF(OR(A3202<=299,AND(A3202<3000,A3202>=1000)),\"NSW\",IF(AND(A3202<=999,A3202>=800),\"NT\",IF(OR(AND(A3202<=8999,A3202>=8000),AND(A3202<=3999,A3202>=3000)),\"VIC\",IF(OR(AND(A3202<=9999,A3202>=9000),AND(A3202<=4999,A3202>=4000)),\"QLD\",IF(AND(A3202<=5999,A3202>=5000),\"SA\",IF(AND(A3202<=6999,A3202>=6000),\"WA\",\"TAS\"))))))","v":"WA"}]
[6385,6,"WA"]
[6386,6,"WA"]
[6390,7,"WA"]
[6391,7,"WA"]
[6392,7,"WA"]
[6393,7,"WA"]
[6394,9,"WA"]
[6395,9,"WA"]
[6396,10,"WA"]
[6397,10,"WA"]
[6398,9,"WA"]
[6401,7,"WA"]
[6403,7,"WA"]
[6405,7,"WA"]
[6407,6,"WA"]
[6409,7,"WA"]
[6410,6,"WA"]
[6411,6,"WA"]
[6412,6,"WA"]
[6413,6,"WA"]
[6414,6,"WA"]
[6415,6,"WA"]
[6417,6,"WA"]
[6418,6,"WA"]
[6419,6,"WA"]
[6420,6,"WA"]
[6421,6,"WA"]
[6422,6,"WA"]
[6423,6,"WA"]
[6424,6,"WA"]
[6425,6,"WA"]
[6426,6,"WA"]
[6427,6,"WA"]
[6428,6,"WA"]
[6429,11,"WA"]
[6430,11,"WA"]
[6431,11,"WA"]
[6432,11,"WA"]
[6433,11,"WA"]
[6434,11,"WA"]
[6435,11,"WA"]
[6436,11,"WA"]
[6437,11,"WA"]
[6438,11,"WA"]
[6439,11,"WA"]
[6440,11,"WA"]
[6442,11,"WA"]
[6443,11,"WA"]
[6444,11,"WA"]
[6445,10,"WA"]
[6446,10,"WA"]
[6447,10,"WA"]
[6448,10,"WA"]
[6450,10,"WA"]
[6460,7,"WA"]
[6461,7,"WA"]
[6462,7,"WA"]
[6463,6,"WA"]
[6464,7,"WA"]
[6465,7,"WA"]
[6466,7,"WA"]
[6467,7,"WA"]
[6468,7,"WA"]
[6470,7,{"$f":"IF(OR(A3266<=299,AND(A3266<3000,A3266>=1000)),\"NSW\",IF(AND(A3266<=999,A3266>=800),\"NT\",IF(OR(AND(A3266<=8999,A3266>=8000),AND(A3266<=3999,A3266>=3000)),\"VIC\",IF(OR(AND(A3266<=9999,A3266>=9000),AND(A3266<=4999,A3266>=4000)),\"QLD\",IF(AND(A3266<=5999,A3266>=5000),\"SA\",IF(AND(A3266<=6999,A3266>=6000),\"WA\",\"TAS\"))))))","v":"WA"}]
[6472,7,"WA"]
[6473,6,"WA"]
[6475,6,"WA"]
[6476,6,"WA"]
[6477,6,"WA"]
[6479,6,"WA"]
[6480,6,"WA"]
[6484,11,"WA"]
[6485,6,"WA"]
[6487,6,"WA"]
[6488,6,"WA"]
[6489,6,"WA"]
[6490,6,"WA"]
[6501,7,"WA"]
[6502,5,"WA"]
[6503,7,"WA"]
[6504,5,"WA"]
[6505,5,"WA"]
[6506,5,"WA"]
[6507,5,"WA"]
[6509,5,"WA"]
[6510,5,"WA"]
[6511,5,"WA"]
[6512,5,"WA"]
[6513,5,"WA"]
[6514,5,"WA"]
[6515,5,"WA"]
[6516,5,"WA"]
[6517,5,"WA"]
[6518,5,"WA"]
[6519,5,"WA"]
[6521,5,"WA"]
[6522,5,"WA"]
[6525,5,"WA"]
[6528,5,"WA"]
[6530,5,"WA"]
[6531,5,"WA"]
[6532,5,"WA"]
[6535,5,"WA"]
[6536,5,"WA"]
[6537,3,"WA"]
[6556,7,"WA"]
[6558,7,"WA"]
[6560,7,"WA"]
[6562,7,"WA"]
[6564,7,"WA"]
[6566,7,"WA"]
[6567,7,"WA"]
[6568,7,"WA"]
[6569,7,"WA"]
[6571,7,"WA"]
[6572,7,"WA"]
[6574,5,"WA"]
[6575,5,"WA"]
[6603,5,"WA"]
[6605,5,"WA"]
[6606,5,"WA"]
[6608,5,"WA"]
[6609,5,"WA"]
[6612,5,"WA"]
[6613,5,"WA"]
[6614,5,"WA"]
[6616,5,"WA"]
[6618,5,{"$f":"IF(OR(A3330<=299,AND(A3330<3000,A3330>=1000)),\"NSW\",IF(AND(A3330<=999,A3330>=800),\"NT\",IF(OR(AND(A3330<=8999,A3330>=8000),AND(A3330<=3999,A3330>=3000)),\"VIC\",IF(OR(AND(A3330<=9999,A3330>=9000),AND(A3330<=4999,A3330>=4000)),\"QLD\",IF(AND(A3330<=5999,A3330>=5000),\"SA\",IF(AND(A3330<=6999,A3330>=6000),\"WA\",\"TAS\"))))))","v":"WA"}]
[6620,5,"WA"]
[6623,5,"WA"]
[6625,5,"WA"]
[6627,5,"WA"]
[6628,5,"WA"]
[6630,5,"WA"]
[6631,5,"WA"]
[6632,5,"WA"]
[6635,5,"WA"]
[6638,3,"WA"]
[6639,3,"WA"]
[6640,3,"WA"]
[6642,3,"WA"]
[6646,11,"WA"]
[6701,3,"WA"]
[6705,3,"WA"]
[6707,2,"WA"]
[6710,2,"WA"]
[6711,2,"WA"]
[6712,2,"WA"]
[6713,2,"WA"]
[6714,2,"WA"]
[6715,2,"WA"]
[6716,2,"WA"]
[6718,2,"WA"]
[6720,2,"WA"]
[6721,2,"WA"]
[6722,2,"WA"]
[6723,2,"WA"]
[6725,1,"WA"]
[6726,1,"WA"]
[6728,1,"WA"]
[6731,1,"WA"]
[6733,1,"WA"]
[6740,1,"WA"]
[6743,1,"WA"]
[6751,2,"WA"]
[6753,2,"WA"]
[6754,2,"WA"]
[6758,2,"WA"]
[6760,2,"WA"]
[6761,2,"WA"]
[6762,2,"WA"]
[6765,1,"WA"]
[6770,1,"WA"]
[6798,1,"WA"]
[6799,1,"WA"]
[6803,7,"WA"]
[6809,7,"WA"]
[6812,7,"WA"]
[6817,7,"WA"]
[6820,7,"WA"]
[6824,7,"WA"]
[6825,7,"WA"]
[6826,7,"WA"]
[6827,7,"WA"]
[6828,7,"WA"]
[6829,7,"WA"]
[6830,7,"WA"]
[6831,7,"WA"]
[6832,7,"WA"]
[6833,7,"WA"]
[6834,7,"WA"]
[6836,7,{"$f":"IF(OR(A3394<=299,AND(A3394<3000,A3394>=1000)),\"NSW\",IF(AND(A3394<=999,A3394>=800),\"NT\",IF(OR(AND(A3394<=8999,A3394>=8000),AND(A3394<=3999,A3394>=3000)),\"VIC\",IF(OR(AND(A3394<=9999,A3394>=9000),AND(A3394<=4999,A3394>=4000)),\"QLD\",IF(AND(A3394<=5999,A3394>=5000),\"SA\",IF(AND(A3394<=6999,A3394>=6000),\"WA\",\"TAS\"))))))","v":"WA"}]
[6837,7,"WA"]
[6838,7,"WA"]
[6839,7,"WA"]
[6840,7,"WA"]
[6841,7,"WA"]
[6842,7,"WA"]
[6843,7,"WA"]
[6844,7,"WA"]
[6845,7,"WA"]
[6846,7,"WA"]
[6847,7,"WA"]
[6848,7,"WA"]
[6849,7,"WA"]
[6850,7,"WA"]
[6851,7,"WA"]
[6865,7,"WA"]
[6872,7,"WA"]
[6873,7,"WA"]
[6892,7,"WA"]
[6893,7,"WA"]
[6900,7,"WA"]
[6901,7,"WA"]
[6902,7,"WA"]
[6903,7,"WA"]
[6904,7,"WA"]
[6905,7,"WA"]
[6906,7,"WA"]
[6907,7,"WA"]
[6909,7,"WA"]
[6910,7,"WA"]
[6911,7,"WA"]
[6912,7,"WA"]
[6913,7,"WA"]
[6914,7,"WA"]
[6915,7,"WA"]
[6916,7,"WA"]
[6917,7,"WA"]
[6918,7,"WA"]
[6919,7,"WA"]
[6920,7,"WA"]
[6921,7,"WA"]
[6922,7,"WA"]
[6923,7,"WA"]
[6924,7,"WA"]
[6925,7,"WA"]
[6926,7,"WA"]
[6927,7,"WA"]
[6928,7,"WA"]
[6929,7,"WA"]
[6931,7,"WA"]
[6932,7,"WA"]
[6933,7,"WA"]
[6934,7,"WA"]
[6935,7,"WA"]
[6936,7,"WA"]
[6937,7,"WA"]
[6938,7,"WA"]
[6939,7,"WA"]
[6940,7,"WA"]
[6941,7,"WA"]
[6942,7,"WA"]
[6943,7,"WA"]
[6944,7,"WA"]
[6945,7,{"$f":"IF(OR(A3458<=299,AND(A3458<3000,A3458>=1000)),\"NSW\",IF(AND(A3458<=999,A3458>=800),\"NT\",IF(OR(AND(A3458<=8999,A3458>=8000),AND(A3458<=3999,A3458>=3000)),\"VIC\",IF(OR(AND(A3458<=9999,A3458>=9000),AND(A3458<=4999,A3458>=4000)),\"QLD\",IF(AND(A3458<=5999,A3458>=5000),\"SA\",IF(AND(A3458<=6999,A3458>=6000),\"WA\",\"TAS\"))))))","v":"WA"}]
[6946,7,"WA"]
[6947,7,"WA"]
[6951,7,"WA"]
[6952,7,"WA"]
[6953,7,"WA"]
[6954,7,"WA"]
[6955,7,"WA"]
[6956,7,"WA"]
[6957,7,"WA"]
[6958,7,"WA"]
[6959,7,"WA"]
[6960,7,"WA"]
[6961,7,"WA"]
[6962,7,"WA"]
[6963,7,"WA"]
[6964,7,"WA"]
[6965,7,"WA"]
[6966,7,"WA"]
[6967,7,"WA"]
[6968,7,"WA"]
[6969,7,"WA"]
[6970,7,"WA"]
[6971,7,"WA"]
[6979,7,"WA"]
[6980,7,"WA"]
[6981,7,"WA"]
[6982,7,"WA"]
[6983,7,"WA"]
[6984,7,"WA"]
[6985,7,"WA"]
[6986,7,"WA"]
[6987,7,"WA"]
[6988,7,"WA"]
[6989,7,"WA"]
[6990,7,"WA"]
[6991,7,"WA"]
[6992,7,"WA"]
[6997,7,"WA"]
[7000,26,"TAS"]
[7001,26,"TAS"]
[7002,26,"TAS"]
[7004,26,"TAS"]
[7005,26,"TAS"]
[7006,26,"TAS"]
[7007,26,"TAS"]
[7008,26,"TAS"]
[7009,26,"TAS"]
[7010,26,"TAS"]
[7011,26,"TAS"]
[7012,26,"TAS"]
[7015,26,"TAS"]
[7016,26,"TAS"]
[7017,26,"TAS"]
[7018,26,"TAS"]
[7019,26,"TAS"]
[7020,26,"TAS"]
[7021,26,"TAS"]
[7022,26,"TAS"]
[7023,26,"TAS"]
[7024,26,"TAS"]
[7025,26,"TAS"]
[7026,26,"TAS"]
[7027,26,"TAS"]
[7030,26,{"$f":"IF(OR(A3522<=299,AND(A3522<3000,A3522>=1000)),\"NSW\",IF(AND(A3522<=999,A3522>=800),\"NT\",IF(OR(AND(A3522<=8999,A3522>=8000),AND(A3522<=3999,A3522>=3000)),\"VIC\",IF(OR(AND(A3522<=9999,A3522>=9000),AND(A3522<=4999,A3522>=4000)),\"QLD\",IF(AND(A3522<=5999,A3522>=5000),\"SA\",IF(AND(A3522<=6999,A3522>=6000),\"WA\",\"TAS\"))))))","v":"TAS"}]
[7050,26,"TAS"]
[7051,26,"TAS"]
[7052,26,"TAS"]
[7053,26,"TAS"]
[7054,26,"TAS"]
[7055,26,"TAS"]
[7109,26,"TAS"]
[7112,26,"TAS"]
[7113,26,"TAS"]
[7116,26,"TAS"]
[7117,26,"TAS"]
[7119,25,"TAS"]
[7120,25,"TAS"]
[7139,23,"TAS"]
[7140,26,"TAS"]
[7150,26,"TAS"]
[7151,26,"TAS"]
[7155,26,"TAS"]
[7162,26,"TAS"]
[7163,26,"TAS"]
[7170,26,"TAS"]
[7171,26,"TAS"]
[7172,26,"TAS"]
[7173,26,"TAS"]
[7174,26,"TAS"]
[7175,26,"TAS"]
[7176,26,"TAS"]
[7177,26,"TAS"]
[7178,26,"TAS"]
[7179,26,"TAS"]
[7180,26,"TAS"]
[7182,26,"TAS"]
[7183,26,"TAS"]
[7184,26,"TAS"]
[7185,26,"TAS"]
[7186,26,"TAS"]
[7187,26,"TAS"]
[7190,28,"TAS"]
[7209,25,"TAS"]
[7210,25,"TAS"]
[7211,25,"TAS"]
[7212,25,"TAS"]
[7213,28,"TAS"]
[7214,28,"TAS"]
[7215,28,"TAS"]
[7216,27,"TAS"]
[7248,25,"TAS"]
[7249,25,"TAS"]
[7250,25,"TAS"]
[7252,25,"TAS"]
[7253,25,"TAS"]
[7254,25,"TAS"]
[7255,27,"TAS"]
[7256,22,"TAS"]
[7257,27,"TAS"]
[7258,25,"TAS"]
[7259,25,"TAS"]
[7260,27,"TAS"]
[7261,27,"TAS"]
[7262,27,"TAS"]
[7263,27,"TAS"]
[7264,27,"TAS"]
[7265,27,"TAS"]
[7267,25,{"$f":"IF(OR(A3586<=299,AND(A3586<3000,A3586>=1000)),\"NSW\",IF(AND(A3586<=999,A3586>=800),\"NT\",IF(OR(AND(A3586<=8999,A3586>=8000),AND(A3586<=3999,A3586>=3000)),\"VIC\",IF(OR(AND(A3586<=9999,A3586>=9000),AND(A3586<=4999,A3586>=4000)),\"QLD\",IF(AND(A3586<=5999,A3586>=5000),\"SA\",IF(AND(A3586<=6999,A3586>=6000),\"WA\",\"TAS\"))))))","v":"TAS"}]
[7268,25,"TAS"]
[7270,25,"TAS"]
[7275,25,"TAS"]
[7276,25,"TAS"]
[7277,25,"TAS"]
[7290,25,"TAS"]
[7291,25,"TAS"]
[7292,25,"TAS"]
[7300,25,"TAS"]
[7301,25,"TAS"]
[7302,25,"TAS"]
[7303,25,"TAS"]
[7304,25,"TAS"]
[7305,22,"TAS"]
[7306,22,"TAS"]
[7307,22,"TAS"]
[7310,22,"TAS"]
[7315,22,"TAS"]
[7316,22,"TAS"]
[7320,22,"TAS"]
[7321,23,"TAS"]
[7322,22,"TAS"]
[7325,22,"TAS"]
[7330,22,"TAS"]
[7331,22,"TAS"]
[7466,23,"TAS"]
[7467,23,"TAS"]
[7468,23,"TAS"]
[7469,23,"TAS"]
[7470,23,"TAS"]
[7800,25,"TAS"]
[7802,26,"TAS"]
[7803,26,"TAS"]
[7804,26,"TAS"]
[7805,26,"TAS"]
[7806,26,"TAS"]
[7807,26,"TAS"]
[7808,26,"TAS"]
[7809,26,"TAS"]
[7810,26,"TAS"]
[7811,26,"TAS"]
[7812,26,"TAS"]
[7813,26,"TAS"]
[7814,26,"TAS"]
[7823,26,"TAS"]
[7824,26,"TAS"]
[7827,26,"TAS"]
[7828,26,"TAS"]
[7829,26,"TAS"]
[7845,26,"TAS"]
[7850,26,"TAS"]
[7892,26,"TAS"]
[7900,25,"TAS"]
[7901,25,"TAS"]
[7902,25,"TAS"]
[7903,25,"TAS"]
[7904,25,"TAS"]
[7905,25,"TAS"]
[7906,25,"TAS"]
[7907,25,"TAS"]
[7908,25,"TAS"]
[7916,22,"TAS"]
[7917,25,"TAS"]
[7918,25,{"$f":"IF(OR(A3650<=299,AND(A3650<3000,A3650>=1000)),\"NSW\",IF(AND(A3650<=999,A3650>=800),\"NT\",IF(OR(AND(A3650<=8999,A3650>=8000),AND(A3650<=3999,A3650>=3000)),\"VIC\",IF(OR(AND(A3650<=9999,A3650>=9000),AND(A3650<=4999,A3650>=4000)),\"QLD\",IF(AND(A3650<=5999,A3650>=5000),\"SA\",IF(AND(A3650<=6999,A3650>=6000),\"WA\",\"TAS\"))))))","v":"TAS"}]
[7919,22,"TAS"]
[7920,25,"TAS"]
[7921,25,"TAS"]
[7922,22,"TAS"]
[7923,25,"TAS"]
[8001,18,"VIC"]
[8002,18,"VIC"]
[8003,18,"VIC"]
[8004,18,"VIC"]
[8005,18,"VIC"]
[8006,18,"VIC"]
[8007,18,"VIC"]
[8008,18,"VIC"]
[8009,18,"VIC"]
[8010,18,"VIC"]
[8045,18,"VIC"]
[8051,18,"VIC"]
[8060,18,"VIC"]
[8061,18,"VIC"]
[8066,18,"VIC"]
[8069,18,"VIC"]
[8070,18,"VIC"]
[8071,18,"VIC"]
[8100,18,"VIC"]
[8101,18,"VIC"]
[8102,18,"VIC"]
[8103,18,"VIC"]
[8107,18,"VIC"]
[8108,18,"VIC"]
[8111,18,"VIC"]
[8120,18,"VIC"]
[8205,18,"VIC"]
[8383,18,"VIC"]
[8386,18,"VIC"]
[8388,18,"VIC"]
[8390,18,"VIC"]
[8393,18,"VIC"]
[8394,18,"VIC"]
[8396,18,"VIC"]
[8399,18,"VIC"]
[8500,18,"VIC"]
[8507,18,"VIC"]
[8538,18,"VIC"]
[8557,18,"VIC"]
[8576,18,"VIC"]
[8622,18,"VIC"]
[8626,18,"VIC"]
[8627,18,"VIC"]
[8659,18,"VIC"]
[8785,18,"VIC"]
[8865,18,"VIC"]
[8873,18,"VIC"]
[9000,51,"QLD"]
[9001,51,"QLD"]
[9002,51,"QLD"]
[9003,51,"QLD"]
[9005,51,"QLD"]
[9007,51,"QLD"]
[9008,51,"QLD"]
[9009,51,"QLD"]
[9010,51,"QLD"]
[9013,51,"QLD"]
[9015,51,"QLD"]
[9016,51,{"$f":"IF(OR(A3714<=299,AND(A3714<3000,A3714>=1000)),\"NSW\",IF(AND(A3714<=999,A3714>=800),\"NT\",IF(OR(AND(A3714<=8999,A3714>=8000),AND(A3714<=3999,A3714>=3000)),\"VIC\",IF(OR(AND(A3714<=9999,A3714>=9000),AND(A3714<=4999,A3714>=4000)),\"QLD\",IF(AND(A3714<=5999,A3714>=5000),\"SA\",IF(AND(A3714<=6999,A3714>=6000),\"WA\",\"TAS\"))))))","v":"QLD"}]
[9017,51,"QLD"]
[9018,51,"QLD"]
[9019,51,"QLD"]
[9020,51,"QLD"]
[9021,51,"QLD"]
[9022,51,"QLD"]
[9023,51,"QLD"]
[9464,51,"QLD"]
[9466,51,"QLD"]
[9726,51,"QLD"]
[9727,51,"QLD"]
[9728,51,"QLD"]
[9729,51,"QLD"]

{"sheet":"Climate_zones","index":4,"n_rows":71,"n_cols":5,"rows_kept":71,"cut":false,"hidden":true,"merged":[]}
["Climate_id","Name","State_id","Hdd","Cdd"]
[1,"Kimberley",1,6,2016]
[2,"Pilbara",1,27,1782]
[3,"Gascoyne",1,159,1001]
[4,"Interior",1,312,770]
[5,"Central West",1,446,553]
[6,"Central Wheat Belt",1,939,327]
[7,"Lower West",1,680,340]
[8,"Great Southern",1,1249,185]
[9,"South West",1,1048,274]
[10,"Southern Coastal",1,1112,132]
[11,"Goldfields",1,899,243]
[12,"Eucla",1,768,360]
[13,"Mallee",2,1160,201]
[14,"Wimmera",2,1610,120]
[15,"Western District",2,2049,104]
[16,"Northern Country",2,1595,248]
[17,"North Central",2,1846,145]
[18,"Central",2,1590,100]
[19,"Northeast",2,2031,194]
[20,"West and South Gippsland",2,2021,136]
[21,"East Gippsland",2,1569,180]
[22,"Northwest Coast and King Island",3,1997,52]
[23,"West & South Coast & Highlands",3,2516,48]
[24,"Central Plateau and Upper Derwent Valley",3,3056,34]
[25,"Central North and Midlands",3,2421,25]
[26,"South East, Huon & Channel and Lower Derwent Valley",3,2049,29]
[27,"North East and Flinders Island",3,1903,137]
[28,"East Coast",3,1869,80]
[29,"Western Agricultural",4,963,229]
[30,"Northwest Pastoral",4,615,286]
[31,"Northeast Pastoral",4,746,340]
[32,"Northern Agricultural",4,954,354]
[33,"Central",4,1554,132]
[34,"Murray",4,1258,173]
[35,"Southeast",4,1813,61]
[36,"Peninsula",5,0,2835]
[37,"Gulf Country",5,4,2288]
[38,"Northern Goldfields and Upper Flinders",5,52,1470]
[39,"Northern Tropical Coast and Tablelands",5,4,2211]
[41,"Herbert and Lower Burdekin",5,17,2429]
[42,"Central Coast - Whitsundays",5,98,1950]
[43,"Capricornia",5,140,1424]
[44,"Central Highlands - Coalfields",5,207,1143]
[45,"Central West",5,255,1024]
[46,"Northwest",5,137,955]
[47,"Channel Country",5,380,820]
[48,"Maranoa and Warrego",5,603,844]
[49,"Darling Downs and Granite Belt",5,660,876]
[50,"Wide Bay and Burnett",5,229,1375]
[51,"Southeast Coast",5,325,1043]
[52,"Upper Western",6,813,523]
[53,"Lower Western",6,1112,230]
[54,"Riverina",6,1330,358]
[55,"North West Slopes and Plains",6,944,470]
[56,"Central West Slopes and Plains",6,1164,283]
[57,"South West Slopes",6,1608,219]
[58,"Northern Rivers",6,401,1122]
[59,"Northern Tablelands",6,1769,206]
[60,"Mid-North Coast",6,596,853]
[61,"Hunter",6,616,653]
[62,"Central Tablelands",6,2023,89]
[63,"Metropolitan",6,642,541]
[64,"Southern Tablelands",6,2186,80]
[65,"South Coast & Illawarra",6,690,577]
[66,"Darwin - Daly",8,0,2895]
[67,"Arnhem",8,0,3344]
[68,"Roper - McArthur",8,10,2165]
[69,"Victoria",8,1,2369]
[70,"Barkly",8,79,958]
[71,"Alice Springs",8,660,379]