{"text_format":"1","workbook":"xlsx","n_sheets":5,"sheets":["Read Me","Assessment form","NGA_factors","Climate_pcode_xref","Climate_zones"],"not_rendered":{"charts":0,"images":10,"macros":1,"external_links":3,"defined_names":135,"comments":2,"pivot_tables":0},"unopened":[],"bounds":{"document_bytes":16777216,"sheet_cells":100000,"rows_first":2000,"rows_last":500,"rows_between":2000,"halvings":0,"cell_chars":16384,"cell_head_chars":4096},"cells_cut":0,"cells_raw":0,"read":"whole","date_system":"1900"}

{"sheet":"Read Me","index":0,"n_rows":27,"n_cols":9,"rows_kept":27,"cut":false,"hidden":false,"merged":[[25,4,25,5],[26,4,26,5],[19,4,19,5],[21,4,21,5],[22,4,22,5],[23,4,23,5],[24,4,24,5],[20,4,20,5],[10,2,10,7],[3,1,3,5],[4,1,4,2],[5,1,5,7],[6,1,6,7],[9,2,9,7],[11,2,11,7],[12,2,12,7],[13,2,13,7],[14,2,14,7],[16,2,16,7]]}
[]
[]
[null,null,null,null,null,"NSW Department of Planning, Industry and Environment\n4 Parramatta Square\nParramatta NSW 2150","T (02) 9995 5000\nE nabers@environment.nsw.gov.au \nnabers.gov.au "]
[null,"NABERS Cogeneration Calculator"]
[null,"Version:",null,"v3.0","Date:","2025-07-01"]
[null,"This tool is to be used to calculate the assessable energy from cogeneration and trigeneration systems."]
[null,"Rateable energy inputs are calculated based on the relative emissions, based on apportionted energy outputs of the system"]
[]
[null,"How to use this calculator"]
[null,1,"Enter data in grey cell cells"]
[null,2,"Intermediate calculations and unused inputs are in blue cells and should not be modified"]
[null,3,"Outputs are in yellow cells."]
[null,4,"Blue cells should not be edited, and will be empty or selected as <Select> for a dropdown cell. They will become grey when they need to be edited. ",null,null,null,null,null," "]
[null,5,"Pale blue cells in tables are locked and are calculation cells. They cannot be modified."]
[null,6,"There are Data validation messages across some tabs. For example \"Check ###\" messages will indicate if rows or columns haven't been completed properly. Please make sure you have addressed all error messages before submitting the spreadsheet."]
[]
[null,null,"If you have any issues using the spreadsheet, please contact the NABERS team"]
[]
[null,null,"Updates"]
[null,null,"Version","Date","Emissions Factors",null,"Notes"]
[null,null,"v3.0","2025-06-01","NGA 2024",null,"Update of emission factors."]
[null,null,"V2.0","2023-06-01","NGA 2022 - Feb 2023",null,"Update of emission factors."]
[null,null,"V1.3","2022-05-01","NGA 2021 - Aug 2021",null,"Review and update of calculator to align with update of Ruling document."]
[null,null,"V1.2","2021-12-01","NGA 2020 - Oct 2020",null,"Updated Emissions Factors, Interface, Verifications, Data Handling."]
[null,null,"V1.1","2020-06-01",null,null,"Updated Rating Calculator, including improved user inputs & interface, data verification, and L1 audit checks."]
[null,null,"V1.1 (draft)","2019-12-01",null,null,"Draft updated calculator."]
[null,null,"V1.0","2017-02-01",null,null,"First Release."]

{"sheet":"Assessment form","index":1,"n_rows":88,"n_cols":28,"rows_kept":88,"cut":false,"hidden":false,"merged":[[11,1,13,1],[42,1,46,1],[81,1,83,1],[21,1,25,1],[31,1,35,1],[17,1,18,1],[32,11,32,25],[16,11,16,25],[67,6,67,8],[68,6,68,8],[69,6,69,8]]}
[]
[null,null,null,null,"NABERS Energy"]
[null,null,null,null,"Cogeneration Calculator"]
[]
[null,null,null,null,"Version 2.0 (1 June 2023)"]
[]
[]
[]
[]
[null,"Step 1: Determining the system location",null,null,null,null,null,null,null,null,null,null,null,null,null,null,null,null,null,null,null,null,null,null,null,null,null,"Validations"]
[]
[null,"Step 1","Where is the co/trigeneration plant physically located?",null,null,null,"(i)",null,null,"ü"]
[null,null,"Enter the postcode for the Rated Premises",null,null,null,"(i)",null,null,"ü"]
[null,null,"Is the system a cogen or trigeneration system?",null,null,null,"(i)",null,null,"ü",null,null,null,null,null,null,null,null,null,null,null,null,null,null,null,null,null,{"$f":"IF($I$22<>\"<Select>\",1,0)","v":1}]
[]
[null,"Step 2: Measuring energy use and generation products"]
[null,null,null,null,null,null,null,null,null,null,null,"Step 2: Measuring energy use and generation products for apportionment"]
[null,"Step 2a","Generator fuel consumption by the co/trigen system [MJ]",null,null,null,"(i)",null,null,"ü"]
[null,null,"Auxiliary electricity used by the co/trigen system [kWh]",null,null,null,"(i)",null,null,"ü"]
[]
[null,"Step 2b"]
[null,"Step 2b","Have all electricity outputs been metered?",null,null,null,"(i)",null,null,"ü",null,null,null,null,null,null,null,null,null,null,null,null,null,null,null,null,null,{"$f":"IF($I$22<>\"<Select>\",1,0)","v":1}]
[null,null,"Electricity generation [kWh]",null,null,null,"(i)",null,null,"ü",null,null,null,null,null,null,null,null,null,null,null,null,null,null,null,null,null,{"$f":"IF($I$22=\"No\",1,IF(AND(ISNUMBER(I23),I23>0),1,0))","v":0}]
[null,null,"Have all useful thermal energy outcomes been metered?",null,null,null,"(i)",null,null,"ü",null,null,null,null,null,null,null,null,null,null,null,null,null,null,null,null,null,{"$f":"IF($I$22<>\"Yes\",1,IF(I24<>\"<Select>\",1,0))","v":1}]
[null,null,"Metered Heating hot water [kWhth]",null,null,null,"(i)",null,null,"ü",null,null,{"$f":"IF(I29=0,\"\",IF(OR(I29=\"NA\",I29=\"\"),1,IF(I29>0,I38/I29,0)))","v":""},null,{"$f":"IF(M25=\"\",\"\",1-M25)","v":""},null,null,null,{"$f":"IF(I37=0,\"\",IF(OR(I28=\"NA\",I28=\"\"),1,IF(I28>0,I37/I28,0)))","v":""},null,{"$f":"IF(S25=\"\",\"\",1-S25)","v":""},null,null,{"$f":"IF(I30=0,\"\",IF(OR(I39=\"NA\",I39=\"\"),1,IF(I39>0,I39/I30,0)))","v":""},null,{"$f":"IF(X25=\"\",\"\",1-X25)","v":""},null,{"$f":"IF(OR($I$22=\"No\",I23=\"No\"),1,IF(AND(ISNUMBER(I25),I25>=0),1,0))","v":0}]
[null,null,"Metered Chilled water generation [kWhth]",null,null,null,"(i)",null,null,"ü",null,null,null,null,null,null,null,null,null,null,null,null,null,null,null,null,null,{"$f":"IF(OR($I$22=\"No\",I23=\"No\"),1,IF(AND(ISNUMBER(I26),I26>=0),1,0))","v":0}]
[null,null,"Default thermal water generation (when thermal outputs unmetered) [kWhth]",null,null,null,null,null,{"$f":"MAX(0.75*I18/3.6-IF(I22<>\"Yes\",0,I23),0)","v":0}]
[null,null,"Used value for generated Electricity [kWh]",null,null,null,null,null,{"$f":"IF(I22<>\"Yes\",0,I23)","v":0}]
[null,null,"Used value for generated Heating Hot Water [kWhth]",null,null,null,null,null,{"$f":"IF(I22<>\"Yes\",IF(I14=\"Cogen\",I27,0),IF(I24<>\"Yes\",IF(I14=\"Cogen\",I27,0),I25))","v":0},null,null,null,null,{"$f":"IF(I29=0,\"NA\",CONCATENATE(FIXED(I29,0),\" kWh\"))","v":"NA"},null,null,null,null,null,{"$f":"IF(I28=0,\"NA\",CONCATENATE(FIXED(I28,0),\" kWh\"))","v":"NA"},null,null,null,null,{"$f":"IF(I30=0,\"NA\",CONCATENATE(FIXED(I30,0),\" kWh\"))","v":"NA"}]
[null,null,"Used value for generated Chilled Water [kWhth]",null,null,null,null,null,{"$f":"IF(I22<>\"Yes\",IF(I14=\"Trigen\",I27,0),IF(I24<>\"Yes\",IF(I14=\"Trigen\",I27,0),I26))","v":0}]
[]
[null,"Step 2c","Was electricity to the Rated Premises submetered?",null,null,null,"(i)",null,null,"ü",null,null,null,null,null,null,null,null,null,null,null,null,null,null,null,null,null,{"$f":"IF($I$22<>\"Yes\",1,IF(I32<>\"<Select>\",1,0))","v":1}]
[null,null,"Electricity from co/trigen plant to Rated Premises [kWhe]",null,null,null,"(i)",null,null,"ü",null,"Step 3: Allocating energy to the Rated premises",null,null,null,null,null,null,null,null,null,null,null,null,null,null,null,{"$f":"IF(OR($I$22<>\"Yes\",I32=\"No\"),1,IF(AND(ISNUMBER(I33),I33>0),1,0))","v":1}]
[null,null,"Was thermal energy to the Rated Premises themally metered?",null,null,null,"(i)",null,null,"ü",null,null,null,null,null,null,null,null,null,null,null,null,null,null,null,null,null,{"$f":"IF(OR($I$22<>\"Yes\",I24=\"No\"),1,IF(I34<>\"<Select>\",1,0))","v":1}]
[null,null,"Metered Heating hot water from co/trigen plant to Rated Premises [kWhth]",null,null,null,"(i)",null,null,"ü",null,null,null,null,null,null,null,null,null,null,null,null,null,null,null,null,null,{"$f":"IF(OR($I$22<>\"Yes\",I23=\"No\",I34=\"No\"),1,IF(AND(ISNUMBER(I35),I35>=0),1,0))","v":1}]
[null,null,"Metered Chilled water from co/trigen plant to Rated Premises [kWhth]",null,null,null,"(i)",null,null,"ü",null,null,null,null,null,null,null,null,{"$f":"CONCATENATE(\"Fuel input: \",FIXED($I$43,0),\" MJ\")","v":{"$error":"#VALUE!"}},null,null,null,null,null,null,null,null,{"$f":"IF(OR($I$22<>\"Yes\",I23=\"No\",I34=\"No\"),1,IF(AND(ISNUMBER(I36),I36>=0),1,0))","v":1}]
[null,null,"Used value for metered electricity to Rated Premises [kWh]",null,null,null,null,null,{"$f":"IF(I32<>\"Yes\",I28,IF(I33=0,I28,I33))","v":0}]
[null,null,"Used value for metered Heating hot water from co/trigen plant to Rated Premises [kWhth]",null,null,null,null,null,{"$f":"IF(I34<>\"Yes\",I29,IF(I35=0,I29,I35))","v":0}]
[null,null,"Used value for metered Chilled water from co/trigen plant to Rated Premises [kWhth]",null,null,null,null,null,{"$f":"IF(I34<>\"Yes\",I30,IF(I36=0,I30,I36))","v":0}]
[null,null,null,null,null,null,null,null,null,null,null,null,null,null,null,null,null,null,{"$f":"CONCATENATE(\"Auxiliaries: \",FIXED($I$44,0),\" kWh\")","v":{"$error":"#VALUE!"}},null,null,null,"Rated Premises"]
[null,"Step 3: Allocating energy and emissions to users",null,null,null,null,null,null,null,null,null,null,null,null,null,null,null,null,{"$f":"IF(I12=\"Offsite\",CONCATENATE(\"Offsite cogen electricity: \",FIXED($I$46,0),\" kWh\"),\"\")","v":""}]
[null,null,null,null,null,null,null,null,null,null,null,null,null,null,null,null,null,null,{"$f":"IF(I12=\"Offsite\",CONCATENATE(\"Offsite cogen electricity GreenPower: \",FIXED($I$47*100,0),\" %\"),\"\")","v":""}]
[null,"Step 3","Generator fuel allocated to Rated Premises (MJ)",null,null,null,"(i)",null,{"$f":"IF(ISNUMBER(F78),IF(I12=\"Onsite\",$F$78*I18,$F$76*I18),\"\")","v":""},"ü",null,null,null,null,null,null,null,null,null,null,null,null,null,null,null,null,null,{"$f":"IF(AND(ISNUMBER(I43),I43>=0),1,0)","v":0}]
[null,null,"Auxiliary electricity allocated to Rated Premises (kWh)",null,null,null,"(i)",null,{"$f":"IF(ISNUMBER(F78),IF(I12=\"Onsite\",$F$78*I19,$F$78*I19),\"\")","v":""},"ü",null,null,null,null,null,null,null,null,null,null,null,null,null,null,null,null,null,{"$f":"IF(AND(ISNUMBER(I44),I44>=0),1,0)","v":0}]
[]
[null,null,"Offsite cogeneration electricity allocated to rated premises (kWh)",null,null,null,"(i)",null,{"$f":"IF(ISNUMBER(F78),IF(I12=\"Onsite\",0,F72*I23),\"\")","v":""},"ü",null,null,null,null,null,null,null,null,null,null,null,null,null,null,null,null,null,{"$f":"IF(AND(ISNUMBER(I46),I46>=0),1,0)","v":0}]
[null,null,"GreenPower % for offsite cogen elec",null,null,null,"(i)",null,{"$f":"IF(ISNUMBER(F78),IF(I12=\"Onsite\",0,I88),\"\")","v":""},"ü",null,null,null,null,null,null,null,null,null,null,null,null,null,null,null,null,null,{"$f":"IF(AND(ISNUMBER(I44),I44>=0),1,0)","v":0}]
[]
[]
[]
[]
[]
[]
[null,"rows 46 to 70 hidden"]
[null,"Calculations"]
[]
[null,"Parameters"]
[null,"State",null,null,null,{"$f":"VLOOKUP('Assessment form'!I13,Climate_pcode_xref!A2:C3727,3,FALSE)","v":{"$error":"#N/A"}}]
[null,"SGEelec, kgCO2/kWh",null,null,null,{"$f":"VLOOKUP('Assessment form'!F58,NGA_factors!E2:N9,10,FALSE)","v":{"$error":"#N/A"}},"kgCO2/kWh"]
[null,"SGEheat = SGEgas, kgCO2/MJ",null,null,null,{"$f":"VLOOKUP('Assessment form'!F58,NGA_factors!E10:N17,10,FALSE)","v":{"$error":"#N/A"}},"kgCO2/MJ"]
[]
[null,"Apportioning to power and thermal energy outputs"]
[null,"Emissions to electricity generation",null,null,null,{"$f":"I28*F59","v":{"$error":"#N/A"}},"kgCO2"]
[null,"Emissions to heating hot water",null,null,null,{"$f":"(I29*3.6)/0.75*F60","v":{"$error":"#N/A"}},"kgCO2"]
[null,"Emissions to chilled water",null,null,null,{"$f":"I30/(4)*F59","v":{"$error":"#N/A"}},"kgCO2"]
[null,"Total emissions",null,null,null,{"$f":"SUM(F63:F65)","v":{"$error":"#N/A"}},"kgCO2"]
[]
[null,"Percentage emissions to electricity",null,null,null,{"$f":"F63/$F$66","v":{"$error":"#N/A"}}]
[null,"Percentage emissions to heating hot water",null,null,null,{"$f":"F64/$F$66","v":{"$error":"#N/A"}}]
[null,"Percentage emissions to chilled water",null,null,null,{"$f":"F65/$F$66","v":{"$error":"#N/A"}}]
[]
[null,"Electricity to rated premises",null,null,null,{"$f":"IF(OR(I28=\"NA\",I28=\"\"),1,IF(I28>0,I37/I28,0))","v":0}]
[null,"Heating hot water to rated premises",null,null,null,{"$f":"IF(OR(I29=\"NA\",I29=\"\"),1,IF(I29>0,I38/I29,0))","v":0}]
[null,"Chilled water to rated premises",null,null,null,{"$f":"IF(OR(I30=\"NA\",I30=\"\"),1,IF(I30>0,I39/I30,0))","v":0}]
[]
[null,"Inputs allocated to Rated Premises (thermal)",null,null,null,{"$f":"F69*F73+F70*F74","v":{"$error":"#N/A"}}]
[null,"Inputs allocated to Rated Premises (power)",null,null,null,{"$f":"F68*F72","v":{"$error":"#N/A"}}]
[null,null,null,null,null,{"$f":"SUM(F76:F77)","v":{"$error":"#N/A"}}]
[]
[]
[]
[null,"Step 3a","Energy inputs allocated to electricity generation (%)",null,null,null,"(i)",null,{"$f":"IF($I$22=\"Yes\",F68,\"\")","v":""},"ü",null,"Step 3a: Allocating inputs to thermal and electricity outputs",null,null,null,null,null,null,null,null,null,null,null,null,null,null,null,{"$f":"IF(AND(ISNUMBER(I82),I82>=0),1,0)","v":0}]
[null,null,"Energy inputs allocated to heating hot water generation (%)",null,null,null,"(i)",null,{"$f":"IF($I$22=\"Yes\",F69,\"\")","v":""},"ü",null,null,null,null,null,null,null,null,null,null,null,null,null,null,null,null,null,{"$f":"IF(AND(ISNUMBER(I83),I83>=0),1,0)","v":0}]
[null,null,"Energy inputs allocated to chilled water generation (%)",null,null,null,"(i)",null,{"$f":"IF($I$22=\"Yes\",F70,\"\")","v":""},"ü",null,null,null,null,null,null,null,null,null,null,null,{"$f":"IF(I22=\"No\",\" Not required\",IF(SUM(AB22:AB26)<5,\" Step 2b is incomplete\",CONCATENATE(\" \",FIXED(I83*100,1),\"% to heating hot water users\")))","v":" Step 2b is incomplete"},null,null,null,null,null,{"$f":"IF(AND(ISNUMBER(I84),I84>=0),1,0)","v":0}]
[null,null,null,null,null,null,null,null,null,null,null,null,null,null,null,{"$f":"CONCATENATE(\"Fuel: \",FIXED($I$18,0),\" MJ\")","v":"Fuel: 0 MJ"}]
[null,"Offsite Cogen Associated fuel input (MJ)",null,null,null,null,null,null,{"$f":"IF(ISNUMBER(F78),IF(I12=\"Onsite\",0,F77*I18),\"\")","v":""},null,null,null,null,null,null,{"$f":"CONCATENATE(\"Auxiliaries: \",FIXED($I$19,0),\" kWh\")","v":"Auxiliaries: 0 kWh"},null,null,null,null,null,null,{"$f":"IF(I22=\"No\",\"Not required\",IF(SUM(AB22:AB26)<5,\"Step 2b is incomplete\",CONCATENATE(FIXED(I82*100,1),\"% to electricity users\")))","v":"Step 2b is incomplete"}]
[null,"Equivalent Elec (kWh) for offsite cogen elec corresponding gas use",null,null,null,null,null,null,{"$f":"I86*F60/F59","v":{"$error":"#VALUE!"}}]
[null,"GreenPower % for offsite cogen elec",null,null,null,null,null,null,{"$f":"(I46-I87)/I46","v":{"$error":"#VALUE!"}},null,null,null,null,null,null,null,null,null,null,null,null,{"$f":"IF(I22=\"No\",\" Not required\",IF(SUM(AB22:AB26)<5,\" Step 2b is incomplete\",CONCATENATE(\" \",FIXED(I84*100,1),\"% to chilled water users\")))","v":" Step 2b is incomplete"}]

{"sheet":"NGA_factors","index":2,"n_rows":41,"n_cols":19,"rows_kept":41,"cut":false,"hidden":true,"merged":[]}
["id","fuelId","fuel","stateId","state","S1_EF_CO2","S1_EF_CH4","S1_EF_N2O","S2_EF","S3_EF","Emission Factor","Energy content factor","Energy content factor unit","SGE123","SGE12","SGE Unit","Release date",null,"Data from Column F, I & J from https://www.dcceew.gov.au/sites/default/files/documents/national-greenhouse-accounts-factors-2022.pdf"]
[1,1,"Electricity",7,"ACT",0,0,0,0.66,0.04,"kgCO2-e/kWh","n/a",null,{"$f":"SUM(F2:J2)","v":0.70000000000000007},{"$f":"SUM(F2:I2)","v":0.66},"kgCO2-e/kWh",2024]
[2,1,"Electricity",6,"NSW",0,0,0,0.66,0.04,"kgCO2-e/kWh","n/a",null,{"$f":"SUM(F3:J3)","v":0.70000000000000007},{"$f":"SUM(F3:I3)","v":0.66},"kgCO2-e/kWh",2024]
[3,1,"Electricity",8,"NT",0,0,0,0.56000000000000005,7.0000000000000007E-2,"kgCO2-e/kWh","n/a",null,{"$f":"SUM(F4:J4)","v":0.63000000000000012},0.56000000000000005,"kgCO2-e/kWh",2024]
[4,1,"Electricity",5,"QLD",0,0,0,0.71,0.1,"kgCO2-e/kWh","n/a",null,0.80999999999999994,0.71,"kgCO2-e/kWh",2024]
[5,1,"Electricity",4,"SA",0,0,0,0.23,0.05,"kgCO2-e/kWh","n/a",null,0.28000000000000003,0.23,"kgCO2-e/kWh",2024]
[6,1,"Electricity",3,"TAS",0,0,0,0.15,0.03,"kgCO2-e/kWh","n/a",null,0.18,0.15,"kgCO2-e/kWh",2024]
[7,1,"Electricity",2,"VIC",0,0,0,0.77,0.09,"kgCO2-e/kWh","n/a",null,0.86,0.77,"kgCO2-e/kWh",2024]
[8,1,"Electricity",1,"WA",0,0,0,0.61,0.09,"kgCO2-e/kWh","n/a",null,0.7,0.61,"kgCO2-e/kWh",2024]
[9,2,"Gas",7,"ACT",51.53,0.1,0.03,0,13.1,"kgCO2-e/GJ","n/a",null,{"$f":"SUM(F10:J10)/1000","v":6.4760000000000012E-2},{"$f":"SUM(F10:I10)/1000","v":5.1660000000000005E-2},"kgCO2-e/MJ",2024]
[10,2,"Gas",6,"NSW",51.53,0.1,0.03,0,13.1,"kgCO2-e/GJ","n/a",null,{"$f":"SUM(F11:J11)/1000","v":6.4760000000000012E-2},5.1660000000000005E-2,"kgCO2-e/MJ",2024]
[11,2,"Gas",8,"NT",51.53,0.1,0.03,0,4.0999999999999996,"kgCO2-e/GJ","n/a",null,{"$f":"SUM(F12:J12)/1000","v":5.5760000000000004E-2},5.1660000000000005E-2,"kgCO2-e/MJ",2024]
[12,2,"Gas",5,"QLD",51.53,0.1,0.03,0,8.8000000000000007,"kgCO2-e/GJ","n/a",null,{"$f":"SUM(F13:J13)/1000","v":6.0460000000000007E-2},5.1660000000000005E-2,"kgCO2-e/MJ",2024]
[13,2,"Gas",4,"SA",51.53,0.1,0.03,0,10.7,"kgCO2-e/GJ","n/a",null,{"$f":"SUM(F14:J14)/1000","v":6.2359999999999999E-2},5.1660000000000005E-2,"kgCO2-e/MJ",2024]
[14,2,"Gas",3,"TAS",51.53,0.1,0.03,0,4,"kgCO2-e/GJ","n/a",null,5.7299999999999997E-2,5.1660000000000005E-2,"kgCO2-e/MJ",2024]
[15,2,"Gas",2,"VIC",51.53,0.1,0.03,0,4,"kgCO2-e/GJ","n/a",null,5.7299999999999997E-2,5.1660000000000005E-2,"kgCO2-e/MJ",2024]
[16,2,"Gas",1,"WA",51.53,0.1,0.03,0,4.0999999999999996,"kgCO2-e/GJ","n/a",null,{"$f":"SUM(F17:J17)/1000","v":5.5760000000000004E-2},5.1660000000000005E-2,"kgCO2-e/MJ",2024]
[17,3,"Coal",7,"ACT",90.24,4.4999999999999998E-2,0.25,0,3,"kgCO2-e/GJ",{"$f":"(22.1+27)/2","v":24.55},"GJ/t",2.43648,{"$f":"SUM(F18:I18)*L18/1000","v":2.22263425},"kgCO2-e/kg",2024]
[18,3,"Coal",6,"NSW",90.24,4.4999999999999998E-2,0.25,0,3,"kgCO2-e/GJ",24.55,"GJ/t",2.43648,{"$f":"SUM(F19:I19)*L19/1000","v":2.22263425},"kgCO2-e/kg",2024]
[19,3,"Coal",8,"NT",90.24,4.4999999999999998E-2,0.25,0,3,"kgCO2-e/GJ",24.55,"GJ/t",2.43648,2.22263425,"kgCO2-e/kg",2024]
[20,3,"Coal",5,"QLD",90.24,4.4999999999999998E-2,0.25,0,3,"kgCO2-e/GJ",24.55,"GJ/t",2.43648,2.22263425,"kgCO2-e/kg",2024]
[21,3,"Coal",4,"SA",90.24,4.4999999999999998E-2,0.25,0,3,"kgCO2-e/GJ",24.55,"GJ/t",2.43648,2.22263425,"kgCO2-e/kg",2024]
[22,3,"Coal",3,"TAS",90.24,4.4999999999999998E-2,0.25,0,3,"kgCO2-e/GJ",24.55,"GJ/t",2.43648,2.22263425,"kgCO2-e/kg",2024]
[23,3,"Coal",2,"VIC",90.24,4.4999999999999998E-2,0.25,0,3,"kgCO2-e/GJ",24.55,"GJ/t",2.43648,2.22263425,"kgCO2-e/kg",2024]
[24,3,"Coal",1,"WA",90.24,4.4999999999999998E-2,0.25,0,3,"kgCO2-e/GJ",24.55,"GJ/t",2.43648,2.22263425,"kgCO2-e/kg",2024]
[25,4,"Oil",7,"ACT",70.2,0.1,0.2,0,17.3,"kgCO2-e/GJ",38.6,"GJ/kL",3.3774999999999999,2.7097200000000004,"kgCO2-e/L",2024]
[26,4,"Oil",6,"NSW",70.2,0.1,0.2,0,17.3,"kgCO2-e/GJ",38.6,"GJ/kL",3.3774999999999999,2.7097200000000004,"kgCO2-e/L",2024]
[27,4,"Oil",8,"NT",70.2,0.1,0.2,0,17.3,"kgCO2-e/GJ",38.6,"GJ/kL",3.3774999999999999,2.7097200000000004,"kgCO2-e/L",2024]
[28,4,"Oil",5,"QLD",70.2,0.1,0.2,0,17.3,"kgCO2-e/GJ",38.6,"GJ/kL",3.3774999999999999,2.7097200000000004,"kgCO2-e/L",2024]
[29,4,"Oil",4,"SA",70.2,0.1,0.2,0,17.3,"kgCO2-e/GJ",38.6,"GJ/kL",3.3774999999999999,2.7097200000000004,"kgCO2-e/L",2024]
[30,4,"Oil",3,"TAS",70.2,0.1,0.2,0,17.3,"kgCO2-e/GJ",38.6,"GJ/kL",3.3774999999999999,2.7097200000000004,"kgCO2-e/L",2024]
[31,4,"Oil",2,"VIC",70.2,0.1,0.2,0,17.3,"kgCO2-e/GJ",38.6,"GJ/kL",3.3774999999999999,2.7097200000000004,"kgCO2-e/L",2024]
[32,4,"Oil",1,"WA",70.2,0.1,0.2,0,17.3,"kgCO2-e/GJ",38.6,"GJ/kL",3.3774999999999999,2.7097200000000004,"kgCO2-e/L",2024]
[33,5,"LPG",7,"ACT",60.6,0,0,0,20.2,"kgCO2-e/GJ",0,"GJ/kL",2.0765599999999997,1.55742,"kgCO2-e/L",2024]
[34,5,"LPG",6,"NSW",60.6,0,0,0,20.2,"kgCO2-e/GJ",0,"GJ/kL",2.0765599999999997,1.55742,"kgCO2-e/L",2024]
[35,5,"LPG",8,"NT",60.6,0,0,0,20.2,"kgCO2-e/GJ",0,"GJ/kL",2.0765599999999997,1.55742,"kgCO2-e/L",2024]
[36,5,"LPG",5,"QLD",60.6,0,0,0,20.2,"kgCO2-e/GJ",0,"GJ/kL",2.0765599999999997,1.55742,"kgCO2-e/L",2024]
[37,5,"LPG",4,"SA",60.6,0,0,0,20.2,"kgCO2-e/GJ",0,"GJ/kL",2.0765599999999997,1.55742,"kgCO2-e/L",2024]
[38,5,"LPG",3,"TAS",60.6,0,0,0,20.2,"kgCO2-e/GJ",0,"GJ/kL",2.0765599999999997,1.55742,"kgCO2-e/L",2024]
[39,5,"LPG",2,"VIC",60.6,0,0,0,20.2,"kgCO2-e/GJ",0,"GJ/kL",2.0765599999999997,1.55742,"kgCO2-e/L",2024]
[40,5,"LPG",1,"WA",60.6,0,0,0,20.2,"kgCO2-e/GJ",0,"GJ/kL",2.0765599999999997,1.55742,"kgCO2-e/L",2024]

{"sheet":"Climate_pcode_xref","index":3,"n_rows":3727,"n_cols":3,"rows_kept":3727,"cut":false,"hidden":true,"merged":[]}
["Postcode","Climate_zone","State"]
[200,64,{"$f":"IF(OR(A2<=299,AND(A2<3000,A2>=1000)),\"NSW\",IF(AND(A2<=999,A2>=800),\"NT\",IF(OR(AND(A2<=8999,A2>=8000),AND(A2<=3999,A2>=3000)),\"VIC\",IF(OR(AND(A2<=9999,A2>=9000),AND(A2<=4999,A2>=4000)),\"QLD\",IF(AND(A2<=5999,A2>=5000),\"SA\",IF(AND(A2<=6999,A2>=6000),\"WA\",\"TAS\"))))))","v":"NSW"}]
[211,64,"NSW"]
[212,64,"NSW"]
[230,64,"NSW"]
[237,64,"NSW"]
[238,64,"NSW"]
[239,64,"NSW"]
[240,64,"NSW"]
[241,64,"NSW"]
[242,64,"NSW"]
[243,64,"NSW"]
[244,64,"NSW"]
[245,64,"NSW"]
[246,64,"NSW"]
[247,64,"NSW"]
[248,64,"NSW"]
[249,64,"NSW"]
[250,64,"NSW"]
[251,64,"NSW"]
[252,64,"NSW"]
[253,64,"NSW"]
[254,64,"NSW"]
[255,64,"NSW"]
[256,64,"NSW"]
[257,64,"NSW"]
[258,64,"NSW"]
[259,64,"NSW"]
[260,64,"NSW"]
[261,64,"NSW"]
[262,64,"NSW"]
[263,64,"NSW"]
[264,64,"NSW"]
[266,64,"NSW"]
[267,64,"NSW"]
[268,64,"NSW"]
[269,64,"NSW"]
[270,64,"NSW"]
[271,64,"NSW"]
[272,64,"NSW"]
[273,64,"NSW"]
[274,64,"NSW"]
[275,64,"NSW"]
[276,64,"NSW"]
[277,64,"NSW"]
[278,64,"NSW"]
[279,64,"NSW"]
[280,64,"NSW"]
[281,64,"NSW"]
[282,64,"NSW"]
[283,64,"NSW"]
[284,64,"NSW"]
[285,64,"NSW"]
[286,64,"NSW"]
[287,64,"NSW"]
[288,64,"NSW"]
[289,64,"NSW"]
[290,64,"NSW"]
[291,64,"NSW"]
[293,64,"NSW"]
[294,64,"NSW"]
[295,64,"NSW"]
[296,64,"NSW"]
[297,64,"NSW"]
[298,64,"NSW"]
[299,64,{"$f":"IF(OR(A66<=299,AND(A66<3000,A66>=1000)),\"NSW\",IF(AND(A66<=999,A66>=800),\"NT\",IF(OR(AND(A66<=8999,A66>=8000),AND(A66<=3999,A66>=3000)),\"VIC\",IF(OR(AND(A66<=9999,A66>=9000),AND(A66<=4999,A66>=4000)),\"QLD\",IF(AND(A66<=5999,A66>=5000),\"SA\",IF(AND(A66<=6999,A66>=6000),\"WA\",\"TAS\"))))))","v":"NSW"}]
[800,66,"NT"]
[801,66,"NT"]
[804,66,"NT"]
[810,66,"NT"]
[811,66,"NT"]
[812,66,"NT"]
[813,66,"NT"]
[814,66,"NT"]
[815,66,"NT"]
[820,66,"NT"]
[821,66,"NT"]
[822,66,"NT"]
[828,66,"NT"]
[830,66,"NT"]
[831,66,"NT"]
[832,66,"NT"]
[835,66,"NT"]
[836,66,"NT"]
[837,66,"NT"]
[840,66,"NT"]
[845,66,"NT"]
[846,66,"NT"]
[847,66,"NT"]
[850,66,"NT"]
[851,66,"NT"]
[852,66,"NT"]
[853,66,"NT"]
[854,66,"NT"]
[860,70,"NT"]
[861,70,"NT"]
[862,70,"NT"]
[870,71,"NT"]
[871,71,"NT"]
[872,71,"NT"]
[880,67,"NT"]
[881,67,"NT"]
[885,67,"NT"]
[886,66,"NT"]
[909,66,"NT"]
[1001,63,"NSW"]
[1002,63,"NSW"]
[1003,63,"NSW"]
[1004,63,"NSW"]
[1005,63,"NSW"]
[1006,63,"NSW"]
[1007,63,"NSW"]
[1008,63,"NSW"]
[1009,63,"NSW"]
[1010,63,"NSW"]
[1011,63,"NSW"]
[1012,63,"NSW"]
[1013,63,"NSW"]
[1015,63,"NSW"]
[1016,63,"NSW"]
{"$rows_left_out":3608}
{"sheet":"Climate_zones","index":4,"n_rows":71,"n_cols":5,"rows_kept":71,"cut":false,"hidden":true,"merged":[]}
["Climate_id","Name","State_id","Hdd","Cdd"]
[1,"Kimberley",1,6,2016]
[2,"Pilbara",1,27,1782]
[3,"Gascoyne",1,159,1001]
[4,"Interior",1,312,770]
[5,"Central West",1,446,553]
[6,"Central Wheat Belt",1,939,327]
[7,"Lower West",1,680,340]
[8,"Great Southern",1,1249,185]
[9,"South West",1,1048,274]
[10,"Southern Coastal",1,1112,132]
[11,"Goldfields",1,899,243]
[12,"Eucla",1,768,360]
[13,"Mallee",2,1160,201]
[14,"Wimmera",2,1610,120]
[15,"Western District",2,2049,104]
[16,"Northern Country",2,1595,248]
[17,"North Central",2,1846,145]
[18,"Central",2,1590,100]
[19,"Northeast",2,2031,194]
[20,"West and South Gippsland",2,2021,136]
[21,"East Gippsland",2,1569,180]
[22,"Northwest Coast and King Island",3,1997,52]
[23,"West & South Coast & Highlands",3,2516,48]
[24,"Central Plateau and Upper Derwent Valley",3,3056,34]
[25,"Central North and Midlands",3,2421,25]
[26,"South East, Huon & Channel and Lower Derwent Valley",3,2049,29]
[27,"North East and Flinders Island",3,1903,137]
[28,"East Coast",3,1869,80]
[29,"Western Agricultural",4,963,229]
[30,"Northwest Pastoral",4,615,286]
[31,"Northeast Pastoral",4,746,340]
[32,"Northern Agricultural",4,954,354]
[33,"Central",4,1554,132]
[34,"Murray",4,1258,173]
[35,"Southeast",4,1813,61]
[36,"Peninsula",5,0,2835]
[37,"Gulf Country",5,4,2288]
[38,"Northern Goldfields and Upper Flinders",5,52,1470]
[39,"Northern Tropical Coast and Tablelands",5,4,2211]
[41,"Herbert and Lower Burdekin",5,17,2429]
[42,"Central Coast - Whitsundays",5,98,1950]
[43,"Capricornia",5,140,1424]
[44,"Central Highlands - Coalfields",5,207,1143]
[45,"Central West",5,255,1024]
[46,"Northwest",5,137,955]
[47,"Channel Country",5,380,820]
[48,"Maranoa and Warrego",5,603,844]
[49,"Darling Downs and Granite Belt",5,660,876]
[50,"Wide Bay and Burnett",5,229,1375]
[51,"Southeast Coast",5,325,1043]
[52,"Upper Western",6,813,523]
[53,"Lower Western",6,1112,230]
[54,"Riverina",6,1330,358]
[55,"North West Slopes and Plains",6,944,470]
[56,"Central West Slopes and Plains",6,1164,283]
[57,"South West Slopes",6,1608,219]
[58,"Northern Rivers",6,401,1122]
[59,"Northern Tablelands",6,1769,206]
[60,"Mid-North Coast",6,596,853]
[61,"Hunter",6,616,653]
[62,"Central Tablelands",6,2023,89]
[63,"Metropolitan",6,642,541]
[64,"Southern Tablelands",6,2186,80]
[65,"South Coast & Illawarra",6,690,577]
[66,"Darwin - Daly",8,0,2895]
[67,"Arnhem",8,0,3344]
[68,"Roper - McArthur",8,10,2165]
[69,"Victoria",8,1,2369]
[70,"Barkly",8,79,958]
[71,"Alice Springs",8,660,379]