{"text_format":"1","workbook":"xlsx","n_sheets":8,"sheets":["Read me","Bin Count Summary","Bin Count Data","MRS Calculator","Composition Audit calculator","drop downs","MRS scores","Support"],"not_rendered":{"charts":0,"images":1,"macros":1,"external_links":5,"defined_names":197,"comments":0,"pivot_tables":0},"unopened":[],"bounds":{"document_bytes":16777216,"sheet_cells":100000,"rows_first":2000,"rows_last":500,"rows_between":2000,"halvings":0,"cell_chars":16384,"cell_head_chars":4096},"cells_cut":0,"cells_raw":0,"read":"whole","date_system":"1900"}

{"sheet":"Read me","index":0,"n_rows":38,"n_cols":7,"rows_kept":38,"cut":false,"hidden":false,"merged":[[3,1,3,4],[14,1,14,5],[5,1,5,5],[8,1,8,5],[12,1,12,5],[13,1,13,5],[37,1,37,5],[35,1,35,5],[6,1,7,5],[10,1,10,5],[26,1,26,5],[30,1,30,5],[31,1,31,5],[29,1,29,5],[23,1,23,5],[24,1,24,5],[16,1,16,5],[17,1,17,5],[22,1,22,5],[21,1,21,5],[18,1,18,5],[19,1,19,5]]}
[]
[]
[null,null,null,null,"Department of Planning, Industry and Environment\n59 Goulburn Street\nSydney NSW 2000","T (02) 9995 5000\nE nabers@environment.nsw.gov.au nabers.gov.au "]
[null,"NABERS WASTE\nCalculations Spreadsheet"]
[null,"Version:","v3.0","Date:","2019-09-30"]
[]
[null,"This spreadsheet enables NABERS accredited assessors to fulfil the \"testing an independent data source\" requirements (section 6.2.3) and the Material Recovery Score requirements (Chapter 7) of the NABERS Waste Rules. The completed spreadsheet must be uploaded to the Ratings page on the Waste Manager platform as part of the evidence for the rating."]
[]
[null,"How to use this calculator"]
[]
{"$rows_left_out":29}
{"sheet":"Bin Count Summary","index":1,"n_rows":21,"n_cols":10,"rows_kept":21,"cut":false,"hidden":false,"merged":[[5,3,5,4],[18,1,18,9],[20,1,20,9],[21,1,30,9]]}
[]
[null,"Premises address:"]
[null,"Rating number:"]
[null,"Rating period:"]
[]
[null,"Waste type","Equipment","Size",null,"Dock","Month to check","Year \n(yyyy)","Weighted average","Verification check result"]
[null,null,null,null,null,null,null,null,{"$f":"IFERROR(IF(B7=\"\",\"\",(SUMPRODUCT('Bin Count Data'!$E$4:$E$34,'Bin Count Data'!$F$4:$F$34)/SUM('Bin Count Data'!$F$4:$F$34))),\"\")","v":""},{"$f":"IF(B7=\"\",\"\",IF(I7=\"\",\"\",IF(I7>Support!$C$2,\"Fail\",\"Pass\")))","v":""}]
[null,null,null,null,null,null,null,null,{"$f":"IFERROR(IF(B8=\"\",\"\",(SUMPRODUCT('Bin Count Data'!$K$4:$K$34,'Bin Count Data'!$L$4:$L$34)/SUM('Bin Count Data'!$L$4:$L$34))),\"\")","v":""},{"$f":"IF(B8=\"\",\"\",IF(I8=\"\",\"\",IF(I8>Support!$C$2,\"Fail\",\"Pass\")))","v":""}]
[null,null,null,null,null,null,null,null,{"$f":"IFERROR(IF(B9=\"\",\"\",(SUMPRODUCT('Bin Count Data'!$Q$4:$Q$34,'Bin Count Data'!$R$4:$R$34)/SUM('Bin Count Data'!$R$4:$R$34))),\"\")","v":""},{"$f":"IF(B9=\"\",\"\",IF(I9=\"\",\"\",IF(I9>Support!$C$2,\"Fail\",\"Pass\")))","v":""}]
[null,null,null,null,null,null,null,null,{"$f":"IFERROR(IF(B10=\"\",\"\",(SUMPRODUCT('Bin Count Data'!$W$4:$W$34,'Bin Count Data'!$X$4:$X$34)/SUM('Bin Count Data'!$X$4:$X$34))),\"\")","v":""},{"$f":"IF(B10=\"\",\"\",IF(I10=\"\",\"\",IF(I10>Support!$C$2,\"Fail\",\"Pass\")))","v":""}]
{"$rows_left_out":12}
{"sheet":"Bin Count Data","index":2,"n_rows":35,"n_cols":66,"rows_kept":35,"cut":false,"hidden":false,"merged":[[1,31,1,33],[1,1,1,3],[1,7,1,9],[1,13,1,15],[1,19,1,21],[1,25,1,27],[1,37,1,39],[1,43,1,45],[1,49,1,51],[1,55,1,57],[1,61,1,63]]}
[]
[null,{"$f":"IF('Bin Count Summary'!$B$7=\"\",\"\",_xlfn.CONCAT('Bin Count Summary'!$B$7,\" - \",'Bin Count Summary'!$C$7,\" - \",'Bin Count Summary'!$D$7,'Bin Count Summary'!$E$7,\" at Dock \",'Bin Count Summary'!$F$7))","v":""},null,null,null,null,null,{"$f":"IF('Bin Count Summary'!$B$8=\"\",\"\",_xlfn.CONCAT('Bin Count Summary'!$B$8,\" - \",'Bin Count Summary'!$C$8,\" - \",'Bin Count Summary'!$D$8,'Bin Count Summary'!$E$8,\" at Dock \",'Bin Count Summary'!$F$8))","v":""},null,null,null,null,null,{"$f":"IF('Bin Count Summary'!$B$9=\"\",\"\",_xlfn.CONCAT('Bin Count Summary'!$B$9,\" - \",'Bin Count Summary'!$C$9,\" - \",'Bin Count Summary'!$D$9,'Bin Count Summary'!$E$9,\" at Dock \",'Bin Count Summary'!$F$9))","v":""},null,null,null,null,null,{"$f":"IF('Bin Count Summary'!$B$10=\"\",\"\",_xlfn.CONCAT('Bin Count Summary'!$B$10,\" - \",'Bin Count Summary'!$C$10,\" - \",'Bin Count Summary'!$D$10,'Bin Count Summary'!$E$10,\" at Dock \",'Bin Count Summary'!$F$10))","v":""},null,null,null,null,null,{"$f":"IF('Bin Count Summary'!$B$11=\"\",\"\",_xlfn.CONCAT('Bin Count Summary'!$B$11,\" - \",'Bin Count Summary'!$C$11,\" - \",'Bin Count Summary'!$D$11,'Bin Count Summary'!$E$11,\" at Dock \",'Bin Count Summary'!$F$11))","v":""},null,null,null,null,null,{"$f":"IF('Bin Count Summary'!$B$12=\"\",\"\",_xlfn.CONCAT('Bin Count Summary'!$B$12,\" - \",'Bin Count Summary'!$C$12,\" - \",'Bin Count Summary'!$D$12,'Bin Count Summary'!$E$12,\" at Dock \",'Bin Count Summary'!$F$12))","v":""},null,null,null,null,null,{"$f":"IF('Bin Count Summary'!$B$13=\"\",\"\",_xlfn.CONCAT('Bin Count Summary'!$B$13,\" - \",'Bin Count Summary'!$C$13,\" - \",'Bin Count Summary'!$D$13,'Bin Count Summary'!$E$13,\" at Dock \",'Bin Count Summary'!$F$13))","v":""},null,null,null,null,null,{"$f":"IF('Bin Count Summary'!$B$14=\"\",\"\",_xlfn.CONCAT('Bin Count Summary'!$B$14,\" - \",'Bin Count Summary'!$C$14,\" - \",'Bin Count Summary'!$D$14,'Bin Count Summary'!$E$14,\" at Dock \",'Bin Count Summary'!$F$14))","v":""},null,null,null,null,null,{"$f":"IF('Bin Count Summary'!$B$15=\"\",\"\",_xlfn.CONCAT('Bin Count Summary'!$B$15,\" - \",'Bin Count Summary'!$C$15,\" - \",'Bin Count Summary'!$D$15,'Bin Count Summary'!$E$15,\" at Dock \",'Bin Count Summary'!$F$15))","v":""},null,null,null,null,null,{"$f":"IF('Bin Count Summary'!$B$16=\"\",\"\",_xlfn.CONCAT('Bin Count Summary'!$B$16,\" - \",'Bin Count Summary'!$C$16,\" - \",'Bin Count Summary'!$D$16,'Bin Count Summary'!$E$16,\" at Dock \",'Bin Count Summary'!$F$16))","v":""},null,null,null,null,null,{"$f":"IF('Bin Count Summary'!$B$17=\"\",\"\",_xlfn.CONCAT('Bin Count Summary'!$B$17,\" - \",'Bin Count Summary'!$C$17,\" - \",'Bin Count Summary'!$D$17,'Bin Count Summary'!$E$17,\" at Dock \",'Bin Count Summary'!$F$17))","v":""}]
[null,"Date","# Bins picked up\nPrimary source","# Bins picked up\nSecondary source","Absoulte variation","Weights for average",null,"Date","# Bins picked up\nPrimary source","# Bins picked up\nSecondary source","Absoulte variation","Weights for average",null,"Date","# Bins picked up\nPrimary source","# Bins picked up\nSecondary source","Absoulte variation","Weights for average",null,"Date","# Bins picked up\nPrimary source","# Bins picked up\nSecondary source","Absoulte variation","Weights for average",null,"Date","# Bins picked up\nPrimary source","# Bins picked up\nSecondary source","Absoulte variation","Weights for average",null,"Date","# Bins picked up\nPrimary source","# Bins picked up\nSecondary source","Absoulte variation","Weights for average",null,"Date","# Bins picked up\nPrimary source","# Bins picked up\nSecondary source","Absoulte variation","Weights for average",null,"Date","# Bins picked up\nPrimary source","# Bins picked up\nSecondary source","Absoulte variation","Weights for average",null,"Date","# Bins picked up\nPrimary source","# Bins picked up\nSecondary source","Absoulte variation","Weights for average",null,"Date","# Bins picked up\nPrimary source","# Bins picked up\nSecondary source","Absoulte variation","Weights for average",null,"Date","# Bins picked up\nPrimary source","# Bins picked up\nSecondary source","Absoulte variation","Weights for average"]
[null,{"$f":"IFERROR(IF($B$2=\"\",\"\",DATE('Bin Count Summary'!$H$7,MONTH(DATEVALUE('Bin Count Summary'!$G$7&\" 1\")),1)),\"Define month to check\")","v":""},null,null,{"$f":"IFERROR(ABS((D4-C4)/C4),0)","v":0},{"$f":"IFERROR(C4/MAX($C$4:$D$34),0)","v":0},null,{"$f":"IFERROR(IF($H$2=\"\",\"\",DATE('Bin Count Summary'!$H$8,MONTH(DATEVALUE('Bin Count Summary'!$G$8&\" 1\")),1)),\"Define month to check\")","v":""},null,null,{"$f":"IFERROR(ABS((J4-I4)/I4),0)","v":0},{"$f":"IFERROR(I4/MAX($I$4:$J$34),0)","v":0},null,{"$f":"IFERROR(IF($N$2=\"\",\"\",DATE('Bin Count Summary'!$H$9,MONTH(DATEVALUE('Bin Count Summary'!$G$9&\" 1\")),1)),\"Define month to check\")","v":""},null,null,{"$f":"IFERROR(ABS((P4-O4)/O4),0)","v":0},{"$f":"IFERROR(O4/MAX($O$4:$P$34),0)","v":0},null,{"$f":"IFERROR(IF($T$2=\"\",\"\",DATE('Bin Count Summary'!$H$10,MONTH(DATEVALUE('Bin Count Summary'!$G$10&\" 1\")),1)),\"Define month to check\")","v":""},null,null,{"$f":"IFERROR(ABS((V4-U4)/U4),0)","v":0},{"$f":"IFERROR(U4/MAX($U$4:$V$34),0)","v":0},null,{"$f":"IFERROR(IF($Z$2=\"\",\"\",DATE('Bin Count Summary'!$H$11,MONTH(DATEVALUE('Bin Count Summary'!$G$11&\" 1\")),1)),\"Define month to check\")","v":""},null,null,{"$f":"IFERROR(ABS((AB4-AA4)/AA4),0)","v":0},{"$f":"IFERROR(AA4/MAX($AA$4:$AB$34),0)","v":0},null,{"$f":"IFERROR(IF($AF$2=\"\",\"\",DATE('Bin Count Summary'!$H$12,MONTH(DATEVALUE('Bin Count Summary'!$G$12&\" 1\")),1)),\"Define month to check\")","v":""},null,null,{"$f":"IFERROR(ABS((AH4-AG4)/AG4),0)","v":0},{"$f":"IFERROR(AG4/MAX($AG$4:$AH$34),0)","v":0},null,{"$f":"IFERROR(IF($AL$2=\"\",\"\",DATE('Bin Count Summary'!$H$13,MONTH(DATEVALUE('Bin Count Summary'!$G$13&\" 1\")),1)),\"Define month to check\")","v":""},null,null,{"$f":"IFERROR(ABS((AN4-AM4)/AM4),0)","v":0},{"$f":"IFERROR(AM4/MAX($AM$4:$AN$34),0)","v":0},null,{"$f":"IFERROR(IF($AR$2=\"\",\"\",DATE('Bin Count Summary'!$H$14,MONTH(DATEVALUE('Bin Count Summary'!$G$14&\" 1\")),1)),\"Define month to check\")","v":""},null,null,{"$f":"IFERROR(ABS((AT4-AS4)/AS4),0)","v":0},{"$f":"IFERROR(AS4/MAX($AS$4:$AT$34),0)","v":0},null,{"$f":"IFERROR(IF($AX$2=\"\",\"\",DATE('Bin Count Summary'!$H$15,MONTH(DATEVALUE('Bin Count Summary'!$G$15&\" 1\")),1)),\"Define month to check\")","v":""},null,null,{"$f":"IFERROR(ABS((AZ4-AY4)/AY4),0)","v":0},{"$f":"IFERROR(AY4/MAX($AY$4:$AZ$34),0)","v":0},null,{"$f":"IFERROR(IF($BD$2=\"\",\"\",DATE('Bin Count Summary'!$H$16,MONTH(DATEVALUE('Bin Count Summary'!$G$16&\" 1\")),1)),\"Define month to check\")","v":""},null,null,{"$f":"IFERROR(ABS((BF4-BE4)/BE4),0)","v":0},{"$f":"IFERROR(BE4/MAX($BE$4:$BF$34),0)","v":0},null,{"$f":"IFERROR(IF($BJ$2=\"\",\"\",DATE('Bin Count Summary'!$H$17,MONTH(DATEVALUE('Bin Count Summary'!$G$17&\" 1\")),1)),\"Define month to check\")","v":""},null,null,{"$f":"IFERROR(ABS((BL4-BK4)/BK4),0)","v":0},{"$f":"IFERROR(BK4/MAX($BK$4:$BL$34),0)","v":0}]
[null,{"$f":"IFERROR(IF(B4=\"\",\"\",IF(B4=EOMONTH($B$4,0),\"\",B4+1)),\"Define month to check\")","v":""},null,null,{"$f":"IFERROR(ABS((D5-C5)/C5),0)","v":0},{"$f":"IFERROR(C5/MAX($C$4:$D$34),0)","v":0},null,{"$f":"IFERROR(IF(H4=\"\",\"\",IF(H4=EOMONTH($H$4,0),\"\",H4+1)),\"Define month to check\")","v":""},null,null,{"$f":"IFERROR(ABS((J5-I5)/I5),0)","v":0},{"$f":"IFERROR(I5/MAX($I$4:$J$34),0)","v":0},null,{"$f":"IFERROR(IF(N4=\"\",\"\",IF(N4=EOMONTH($N$4,0),\"\",N4+1)),\"Define month to check\")","v":""},null,null,{"$f":"IFERROR(ABS((P5-O5)/O5),0)","v":0},{"$f":"IFERROR(O5/MAX($O$4:$P$34),0)","v":0},null,{"$f":"IFERROR(IF(T4=\"\",\"\",IF(T4=EOMONTH($T$4,0),\"\",T4+1)),\"Define month to check\")","v":""},null,null,{"$f":"IFERROR(ABS((V5-U5)/U5),0)","v":0},{"$f":"IFERROR(U5/MAX($U$4:$V$34),0)","v":0},null,{"$f":"IFERROR(IF(Z4=\"\",\"\",IF(Z4=EOMONTH($Z$4,0),\"\",Z4+1)),\"Define month to check\")","v":""},null,null,{"$f":"IFERROR(ABS((AB5-AA5)/AA5),0)","v":0},{"$f":"IFERROR(AA5/MAX($AA$4:$AB$34),0)","v":0},null,{"$f":"IFERROR(IF(AF4=\"\",\"\",IF(AF4=EOMONTH($AF$4,0),\"\",AF4+1)),\"Define month to check\")","v":""},null,null,{"$f":"IFERROR(ABS((AH5-AG5)/AG5),0)","v":0},{"$f":"IFERROR(AG5/MAX($AG$4:$AH$34),0)","v":0},null,{"$f":"IFERROR(IF(AL4=\"\",\"\",IF(AL4=EOMONTH($AL$4,0),\"\",AL4+1)),\"Define month to check\")","v":""},null,null,{"$f":"IFERROR(ABS((AN5-AM5)/AM5),0)","v":0},{"$f":"IFERROR(AM5/MAX($AM$4:$AN$34),0)","v":0},null,{"$f":"IFERROR(IF(AR4=\"\",\"\",IF(AR4=EOMONTH($AR$4,0),\"\",AR4+1)),\"Define month to check\")","v":""},null,null,{"$f":"IFERROR(ABS((AT5-AS5)/AS5),0)","v":0},{"$f":"IFERROR(AS5/MAX($AS$4:$AT$34),0)","v":0},null,{"$f":"IFERROR(IF(AX4=\"\",\"\",IF(AX4=EOMONTH($AX$4,0),\"\",AX4+1)),\"Define month to check\")","v":""},null,null,{"$f":"IFERROR(ABS((AZ5-AY5)/AY5),0)","v":0},{"$f":"IFERROR(AY5/MAX($AY$4:$AZ$34),0)","v":0},null,{"$f":"IFERROR(IF(BD4=\"\",\"\",IF(BD4=EOMONTH($BD$4,0),\"\",BD4+1)),\"Define month to check\")","v":""},null,null,{"$f":"IFERROR(ABS((BF5-BE5)/BE5),0)","v":0},{"$f":"IFERROR(BE5/MAX($BE$4:$BF$34),0)","v":0},null,{"$f":"IFERROR(IF(BJ4=\"\",\"\",IF(BJ4=EOMONTH($BJ$4,0),\"\",BJ4+1)),\"Define month to check\")","v":""},null,null,{"$f":"IFERROR(ABS((BL5-BK5)/BK5),0)","v":0},{"$f":"IFERROR(BK5/MAX($BK$4:$BL$34),0)","v":0}]
[null,{"$f":"IFERROR(IF(B5=\"\",\"\",IF(B5=EOMONTH($B$4,0),\"\",B5+1)),\"Define month to check\")","v":""},null,null,{"$f":"IFERROR(ABS((D6-C6)/C6),0)","v":0},{"$f":"IFERROR(C6/MAX($C$4:$D$34),0)","v":0},null,{"$f":"IFERROR(IF(H5=\"\",\"\",IF(H5=EOMONTH($H$4,0),\"\",H5+1)),\"Define month to check\")","v":""},null,null,0,0,null,{"$f":"IFERROR(IF(N5=\"\",\"\",IF(N5=EOMONTH($N$4,0),\"\",N5+1)),\"Define month to check\")","v":""},null,null,0,{"$f":"IFERROR(O6/MAX($O$4:$P$34),0)","v":0},null,{"$f":"IFERROR(IF(T5=\"\",\"\",IF(T5=EOMONTH($T$4,0),\"\",T5+1)),\"Define month to check\")","v":""},null,null,0,0,null,{"$f":"IFERROR(IF(Z5=\"\",\"\",IF(Z5=EOMONTH($Z$4,0),\"\",Z5+1)),\"Define month to check\")","v":""},null,null,0,0,null,{"$f":"IFERROR(IF(AF5=\"\",\"\",IF(AF5=EOMONTH($AF$4,0),\"\",AF5+1)),\"Define month to check\")","v":""},null,null,0,0,null,{"$f":"IFERROR(IF(AL5=\"\",\"\",IF(AL5=EOMONTH($AL$4,0),\"\",AL5+1)),\"Define month to check\")","v":""},null,null,0,0,null,{"$f":"IFERROR(IF(AR5=\"\",\"\",IF(AR5=EOMONTH($AR$4,0),\"\",AR5+1)),\"Define month to check\")","v":""},null,null,0,0,null,{"$f":"IFERROR(IF(AX5=\"\",\"\",IF(AX5=EOMONTH($AX$4,0),\"\",AX5+1)),\"Define month to check\")","v":""},null,null,0,0,null,{"$f":"IFERROR(IF(BD5=\"\",\"\",IF(BD5=EOMONTH($BD$4,0),\"\",BD5+1)),\"Define month to check\")","v":""},null,null,0,0,null,{"$f":"IFERROR(IF(BJ5=\"\",\"\",IF(BJ5=EOMONTH($BJ$4,0),\"\",BJ5+1)),\"Define month to check\")","v":""},null,null,0,0]
[null,"",null,null,{"$f":"IFERROR(ABS((D7-C7)/C7),0)","v":0},{"$f":"IFERROR(C7/MAX($C$4:$D$34),0)","v":0},null,"",null,null,0,0,null,"",null,null,0,0,null,"",null,null,0,0,null,"",null,null,0,0,null,"",null,null,0,0,null,"",null,null,0,0,null,"",null,null,0,0,null,"",null,null,0,0,null,"",null,null,0,0,null,"",null,null,0,0]
[null,"",null,null,{"$f":"IFERROR(ABS((D8-C8)/C8),0)","v":0},{"$f":"IFERROR(C8/MAX($C$4:$D$34),0)","v":0},null,"",null,null,0,0,null,"",null,null,0,0,null,"",null,null,0,0,null,"",null,null,0,0,null,"",null,null,0,0,null,"",null,null,0,0,null,"",null,null,0,0,null,"",null,null,0,0,null,"",null,null,0,0,null,"",null,null,0,0]
[null,{"$f":"IFERROR(IF(B8=\"\",\"\",IF(B8=EOMONTH($B$4,0),\"\",B8+1)),\"Define month to check\")","v":""},null,null,{"$f":"IFERROR(ABS((D9-C9)/C9),0)","v":0},{"$f":"IFERROR(C9/MAX($C$4:$D$34),0)","v":0},null,"",null,null,0,0,null,"",null,null,0,0,null,"",null,null,0,0,null,"",null,null,0,0,null,"",null,null,0,0,null,"",null,null,0,0,null,"",null,null,0,0,null,"",null,null,0,0,null,"",null,null,0,0,null,"",null,null,0,0]
[null,"",null,null,0,0,null,"",null,null,0,0,null,"",null,null,0,0,null,"",null,null,0,0,null,"",null,null,0,0,null,"",null,null,0,0,null,"",null,null,0,0,null,"",null,null,0,0,null,"",null,null,0,0,null,"",null,null,0,0,null,"",null,null,0,0]
{"$rows_left_out":26}
{"sheet":"MRS Calculator","index":3,"n_rows":93,"n_cols":14,"rows_kept":93,"cut":false,"hidden":false,"merged":[[1,1,1,6],[1,8,1,13],[3,1,3,6],[3,8,3,13],[13,8,13,11],[30,9,30,13],[31,9,31,13],[27,8,27,11],[16,8,18,13],[29,8,29,12]]}
[]
[null,"MRS value tables",null,null,null,null,null,null,"Calculating MRS value for mixed content bins"]
[]
[null,"Use the tables below to determine the MRS value for a particular bin type, waste type and outcome select from the tables below. The results must  be entered into the ratings page.",null,null,null,null,null,null,"If no composition audit was completed then use the table below to determine the MRS Value for that bin, using the MRS points determined from the adjacent tables."]
[]
[null,"Paper/cardboard",null,null,null,null,null,null,"Bin","Material Categories","Material Type","Outcome","MRS Points","Percent"]
[null,"Bin","Material categories","Material type","Outcome","Merged","MRS points",null,"Mixed Recycling","Plastic","HDPE - rigid",null,null,2.8000000000000004E-2]
[null,"Mixed content","Paper/Cardboard","Mixed cardboard bale","New mixed cardboard grade product",{"$f":"B8&\" \"&C8&\" \"&D8&\" \"&E8","v":"Mixed content Paper/Cardboard Mixed cardboard bale New mixed cardboard grade product"},{"$f":"VLOOKUP(F8,'MRS scores'!$E$2:$F$257,2,FALSE)","v":4},null,"Mixed Recycling","Plastic","PET - rigid",null,null,0.12600000000000003]
[null,null,"Paper/Cardboard",null,null,{"$f":"B9&\" \"&C9&\" \"&D9&\" \"&E9","v":" Paper/Cardboard  "},{"$f":"VLOOKUP(F9,'MRS scores'!$E$2:$F$257,2,FALSE)","v":{"$error":"#N/A"}},null,"Mixed Recycling","Plastic","Plastic containers (mixed plastic bales)",null,null,0.12600000000000003]
[null,null,"Paper/Cardboard",null,null," Paper/Cardboard  ",{"$f":"VLOOKUP(F10,'MRS scores'!$E$2:$F$257,2,FALSE)","v":{"$error":"#N/A"}},null,"Mixed Recycling","Metals","Aluminium cans",null,null,0.02]
{"$rows_left_out":84}
{"sheet":"Composition Audit calculator","index":4,"n_rows":22,"n_cols":5,"rows_kept":22,"cut":false,"hidden":false,"merged":[[3,1,3,4],[12,1,12,4],[1,1,1,6],[21,1,21,2],[4,1,4,6],[11,1,11,6],[5,2,5,4],[6,2,6,4],[7,2,7,4],[8,2,8,4],[9,2,9,4]]}
[]
[null,"Composition Audit results calculator"]
[]
[null,"Use the table below to determine the percentage splits of materials from mixed matieral bins, as per section 7.2.4 of the Waste Rules. These values should be transferred to the MRS calculator tab to determine the MRS value for the bin. \n\nIf you have multiple bins, then copy and paste this table into the blank space below."]
[null,"Audit details"]
[null,"Bin service audited:"]
[null,"Total weight of contamination:"]
[null,"Number of bins audited"]
[null,"Audit date:"]
[null,"Name of auditor:"]
{"$rows_left_out":13}
{"sheet":"drop downs","index":5,"n_rows":92,"n_cols":5,"rows_kept":92,"cut":false,"hidden":true,"merged":[]}
[null,"Composites"]
[null,"Bin","Material categories","Material type","Outcome"]
[null,"Mixed content","Composites","Liquid paper board","New mixed paper & cardboard grade product"]
[null,"Pre-sorted bin",null,"Coffee cups","Used in compost or other organics process"]
[null,null,null,null,"Converted to composite plastic product"]
[null,null,null,null,"Burnt"]
[]
[null,"e-waste"]
[null,"Bin","Material categories","Material type","Outcome"]
[null,"Pre-sorted bin","E-waste","Batteries","Treated appropriately - licenced facility"]
{"$rows_left_out":83}
{"sheet":"MRS scores","index":6,"n_rows":257,"n_cols":6,"rows_kept":257,"cut":false,"hidden":true,"merged":[]}
["Bin","Material categories","Material type","Outcome","Merged","points"]
["Mixed content","Plastic","PET - 1","New PET product",{"$f":"A2&\" \"&B2&\" \"&C2&\" \"&D2","v":"Mixed content Plastic PET - 1 New PET product"},3]
["Mixed content","Plastic","PET - 1","Downcycled","Mixed content Plastic PET - 1 Downcycled",2]
["Mixed content","Plastic","PET - 1","Burnt","Mixed content Plastic PET - 1 Burnt",0]
["Mixed content","Plastic","HDPE - 2","New HDPE product","Mixed content Plastic HDPE - 2 New HDPE product",3]
["Mixed content","Plastic","HDPE - 2","Downcycled","Mixed content Plastic HDPE - 2 Downcycled",2]
["Mixed content","Plastic","HDPE - 2","Burnt","Mixed content Plastic HDPE - 2 Burnt",0]
["Mixed content","Plastic","PVC - 3 - Rigid","New PVC product","Mixed content Plastic PVC - 3 - Rigid New PVC product",3]
["Mixed content","Plastic","PVC - 3 - Rigid","Downcycled","Mixed content Plastic PVC - 3 - Rigid Downcycled",2]
["Mixed content","Plastic","PVC - 3 - Rigid","Burnt","Mixed content Plastic PVC - 3 - Rigid Burnt",0]
{"$rows_left_out":248}
{"sheet":"Support","index":7,"n_rows":16,"n_cols":9,"rows_kept":16,"cut":false,"hidden":true,"merged":[]}
[]
[null,"Threshold ",0.2]
[]
[]
[null,"January",null,"General waste",null,null,"Mobile bin",null,"m³"]
[null,"February",null,"Mixed recycling",null,null,"Compactor",null,"L"]
[null,"March",null,"Paper & Cardboard",null,null,"Bags"]
[null,"April",null,"Cardboard (compacted)",null,null,"Bales"]
[null,"May",null,"Dry waste",null,null,"Cage"]
[null,"June",null,"Paper",null,null,"Crate"]
{"$rows_left_out":6}